BDBM50013549 4-[3-(Quinolin-2-ylmethoxy)-phenoxymethyl]-3-(1H-tetrazol-5-ylmethoxy)-benzoic acid methyl ester::CHEMBL18919
SMILES: COC(=O)c1ccc(COc2cccc(OCc3ccc4ccccc4n3)c2)c(OCc2nnn[nH]2)c1
InChI Key: InChIKey=SSPUCOWJOYUIGO-UHFFFAOYSA-N
Data: 1 KI
Activity Spreadsheet -- Enzyme Inhibition Constant Data from BindingDB
Found 1 hit for monomerid = 50013549
Trg + Lig
Ki
nM
ΔG°
kcal/mole
IC50
nM
Kd
nM
EC50/IC50
nM
koff
s-1
kon
M-1s-1
pHTemp
°C
Cysteinyl leukotriene receptor 1
(GUINEA PIG)
BDBM50013549
(4-[3-(Quinolin-2-ylmethoxy)-phenoxymethyl]-3-(1H-t...)
Show SMILES COC(=O)c1ccc(COc2cccc(OCc3ccc4ccccc4n3)c2)c(OCc2nnn[nH]2)c1
Show InChI InChI=1S/C27H23N5O5/c1-34-27(33)19-9-10-20(25(13-19)37-17-26-29-31-32-30-26)15-35-22-6-4-7-23(14-22)36-16-21-12-11-18-5-2-3-8-24(18)28-21/h2-14H,15-17H2,1H3,(H,29,30,31,32)
8n/an/an/an/an/an/an/an/a
Rorer Central Research
Curated by ChEMBL
Assay Description
Binding affinity against Cysteinyl leukotriene D4 receptor from guinea pig lung was determined using [3H]-LTD4 (0.2 nM)
J Med Chem 33: 1194-200 (1990)
BindingDB Entry DOI: 10.7270/Q2PK0F4V