BDBM50013556 2-{4-[2-(1H-Tetrazol-5-ylmethoxy)-benzyloxy]-phenoxymethyl}-quinoline::CHEMBL18699
SMILES: C(Oc1ccccc1COc1ccc(OCc2ccc3ccccc3n2)cc1)c1nnn[nH]1
InChI Key: InChIKey=MIYCVNSXYWJAQH-UHFFFAOYSA-N
Data: 1 KI
Activity Spreadsheet -- Enzyme Inhibition Constant Data from BindingDB
Found 1 hit for monomerid = 50013556
Trg + Lig
Ki
nM
ΔG°
kcal/mole
IC50
nM
Kd
nM
EC50/IC50
nM
koff
s-1
kon
M-1s-1
pHTemp
°C
Cysteinyl leukotriene receptor 1
(GUINEA PIG)
BDBM50013556
(2-{4-[2-(1H-Tetrazol-5-ylmethoxy)-benzyloxy]-pheno...)
Show SMILES C(Oc1ccccc1COc1ccc(OCc2ccc3ccccc3n2)cc1)c1nnn[nH]1
Show InChI InChI=1S/C25H21N5O3/c1-3-7-23-18(5-1)9-10-20(26-23)16-32-22-13-11-21(12-14-22)31-15-19-6-2-4-8-24(19)33-17-25-27-29-30-28-25/h1-14H,15-17H2,(H,27,28,29,30)
2.10n/an/an/an/an/an/an/an/a
Rorer Central Research
Curated by ChEMBL
Assay Description
Binding affinity against Cysteinyl leukotriene D4 receptor from guinea pig lung was determined using [3H]-LTD4 (0.2 nM)
J Med Chem 33: 1194-200 (1990)
BindingDB Entry DOI: 10.7270/Q2PK0F4V