BDBM50013562 7-Chloro-2-{4-[2-(1H-tetrazol-5-ylmethyl)-benzyloxy]-phenoxymethyl}-quinoline::CHEMBL19158
SMILES: Clc1ccc2ccc(COc3ccc(OCc4ccccc4Cc4nnn[nH]4)cc3)nc2c1
InChI Key: InChIKey=CFOGMFANYLGVOW-UHFFFAOYSA-N
Data: 1 KI
Activity Spreadsheet -- Enzyme Inhibition Constant Data from BindingDB
Found 1 hit for monomerid = 50013562
Trg + Lig
Ki
nM
ΔG°
kcal/mole
IC50
nM
Kd
nM
EC50/IC50
nM
koff
s-1
kon
M-1s-1
pHTemp
°C
Cysteinyl leukotriene receptor 1
(GUINEA PIG)
BDBM50013562
(7-Chloro-2-{4-[2-(1H-tetrazol-5-ylmethyl)-benzylox...)
Show SMILES Clc1ccc2ccc(COc3ccc(OCc4ccccc4Cc4nnn[nH]4)cc3)nc2c1
Show InChI InChI=1S/C25H20ClN5O2/c26-20-7-5-17-6-8-21(27-24(17)14-20)16-33-23-11-9-22(10-12-23)32-15-19-4-2-1-3-18(19)13-25-28-30-31-29-25/h1-12,14H,13,15-16H2,(H,28,29,30,31)
2.5n/an/an/an/an/an/an/an/a
Rorer Central Research
Curated by ChEMBL
Assay Description
Binding affinity against Cysteinyl leukotriene D4 receptor from guinea pig lung was determined using [3H]-LTD4 (0.2 nM)
J Med Chem 33: 1194-200 (1990)
BindingDB Entry DOI: 10.7270/Q2PK0F4V