BDBM50013864 CHEMBL3265296
SMILES: OC(=O)CSc1cc(NS(=O)(=O)c2ccccc2-c2ccccc2)c2ccccc2c1O
InChI Key: InChIKey=RXYYPYDPEDTDSR-UHFFFAOYSA-N
Data: 5 KI  1 IC50
Activity Spreadsheet -- Enzyme Inhibition Constant Data from BindingDB
Found 6 hits for monomerid = 50013864
Trg + Lig
Ki
nM
ΔG°
kcal/mole
IC50
nM
Kd
nM
EC50/IC50
nM
koff
s-1
kon
M-1s-1
pHTemp
°C
Induced myeloid leukemia cell differentiation protein Mcl-1
(Homo sapiens (Human))
BDBM50013864
(CHEMBL3265296)
Show SMILES OC(=O)CSc1cc(NS(=O)(=O)c2ccccc2-c2ccccc2)c2ccccc2c1O
Show InChI InChI=1S/C24H19NO5S2/c26-23(27)15-31-21-14-20(18-11-4-5-12-19(18)24(21)28)25-32(29,30)22-13-7-6-10-17(22)16-8-2-1-3-9-16/h1-14,25,28H,15H2,(H,26,27)
NCI pathway
2.03E+3n/an/an/an/an/an/an/an/a
University of Michigan Medical School
Curated by ChEMBL
Assay Description
Displacement of Flu-BID/FAM-BID from His-tagged MCL1 (171 to 327) (unknown origin) expressed in Escherichia coli BL21(DE3) after 3 hrs by fluorescenc...
J Med Chem 57: 4111-33 (2014)
Article DOI: 10.1021/jm500010b
BindingDB Entry DOI: 10.7270/Q20003NC
BCL-W
(Homo sapiens (Human))
BDBM50013864
(CHEMBL3265296)
Show SMILES OC(=O)CSc1cc(NS(=O)(=O)c2ccccc2-c2ccccc2)c2ccccc2c1O
Show InChI InChI=1S/C24H19NO5S2/c26-23(27)15-31-21-14-20(18-11-4-5-12-19(18)24(21)28)25-32(29,30)22-13-7-6-10-17(22)16-8-2-1-3-9-16/h1-14,25,28H,15H2,(H,26,27)
4.41E+3n/an/an/an/an/an/an/an/a
University of Michigan Medical School
Curated by ChEMBL
Assay Description
Displacement of Flu-BID/FAM-BID from His-tagged BCLW (1 to 155) (unknown origin) expressed in Escherichia coli BL21(DE3) after 3 hrs by fluorescence ...
J Med Chem 57: 4111-33 (2014)
Article DOI: 10.1021/jm500010b
BindingDB Entry DOI: 10.7270/Q20003NC
Bcl-2-related protein A1
(Homo sapiens (Human))
BDBM50013864
(CHEMBL3265296)
Show SMILES OC(=O)CSc1cc(NS(=O)(=O)c2ccccc2-c2ccccc2)c2ccccc2c1O
Show InChI InChI=1S/C24H19NO5S2/c26-23(27)15-31-21-14-20(18-11-4-5-12-19(18)24(21)28)25-32(29,30)22-13-7-6-10-17(22)16-8-2-1-3-9-16/h1-14,25,28H,15H2,(H,26,27)
NCI pathway
1.73E+4n/an/an/an/an/an/an/an/a
University of Michigan Medical School
Curated by ChEMBL
Assay Description
Displacement of Flu-BID/FAM-BID from His-tagged A1-BFL-1 (1 to 151) (unknown origin) expressed in Escherichia coli BL21(DE3) after 3 hrs by fluoresce...
J Med Chem 57: 4111-33 (2014)
Article DOI: 10.1021/jm500010b
BindingDB Entry DOI: 10.7270/Q20003NC
Apoptosis regulator Bcl-2
(Homo sapiens (Human))
BDBM50013864
(CHEMBL3265296)
Show SMILES OC(=O)CSc1cc(NS(=O)(=O)c2ccccc2-c2ccccc2)c2ccccc2c1O
Show InChI InChI=1S/C24H19NO5S2/c26-23(27)15-31-21-14-20(18-11-4-5-12-19(18)24(21)28)25-32(29,30)22-13-7-6-10-17(22)16-8-2-1-3-9-16/h1-14,25,28H,15H2,(H,26,27)
2.38E+4n/an/an/an/an/an/an/an/a
University of Michigan Medical School
Curated by ChEMBL
Assay Description
Displacement of Flu-BID/FAM-BID from His-tagged BCL2 (1 to 202) (unknown origin) expressed in Escherichia coli BL21(DE3) after 3 hrs by fluorescence ...
J Med Chem 57: 4111-33 (2014)
Article DOI: 10.1021/jm500010b
BindingDB Entry DOI: 10.7270/Q20003NC
Bcl-2-like protein 1
(Homo sapiens (Human))
BDBM50013864
(CHEMBL3265296)
Show SMILES OC(=O)CSc1cc(NS(=O)(=O)c2ccccc2-c2ccccc2)c2ccccc2c1O
Show InChI InChI=1S/C24H19NO5S2/c26-23(27)15-31-21-14-20(18-11-4-5-12-19(18)24(21)28)25-32(29,30)22-13-7-6-10-17(22)16-8-2-1-3-9-16/h1-14,25,28H,15H2,(H,26,27)
NCI pathway
Reactome pathway
4.82E+4n/an/an/an/an/an/an/an/a
University of Michigan Medical School
Curated by ChEMBL
Assay Description
Displacement of Flu-BID/FAM-BID from His-tagged BCLX-L (1 to 209) (unknown origin) expressed in Escherichia coli BL21(DE3) after 3 hrs by fluorescenc...
J Med Chem 57: 4111-33 (2014)
Article DOI: 10.1021/jm500010b
BindingDB Entry DOI: 10.7270/Q20003NC
Induced myeloid leukemia cell differentiation protein Mcl-1
(Homo sapiens (Human))
BDBM50013864
(CHEMBL3265296)
Show SMILES OC(=O)CSc1cc(NS(=O)(=O)c2ccccc2-c2ccccc2)c2ccccc2c1O
Show InChI InChI=1S/C24H19NO5S2/c26-23(27)15-31-21-14-20(18-11-4-5-12-19(18)24(21)28)25-32(29,30)22-13-7-6-10-17(22)16-8-2-1-3-9-16/h1-14,25,28H,15H2,(H,26,27)
NCI pathway
n/an/a 9.90E+3n/an/an/an/an/an/a
University of Michigan Medical School
Curated by ChEMBL
Assay Description
Binding affinity to His-tagged MCL1 (171 to 327) (unknown origin) expressed in Escherichia coli BL21(DE3) assessed as inhibition of MCL1-N-terminal b...
J Med Chem 57: 4111-33 (2014)
Article DOI: 10.1021/jm500010b
BindingDB Entry DOI: 10.7270/Q20003NC