null
SMILES: OC(=O)CSc1cc(NS(=O)(=O)Cc2ccc(Cl)cc2)c2ccccc2c1O
InChI Key: InChIKey=KWOGXXULKCPPGD-UHFFFAOYSA-N
Activity Spreadsheet -- Enzyme Inhibition Constant Data from BindingDB
Found 2 hits for monomerid = 50013872
Trg + Lig
Ki
nM
ΔG°
kcal/mole
IC50
nM
Kd
nM
EC50/IC50
nM
koff
s-1
kon
M-1s-1
pHTemp
°C
Induced myeloid leukemia cell differentiation protein Mcl-1
(Homo sapiens (Human))
BDBM50013872
(CHEMBL3265303)
Show SMILES OC(=O)CSc1cc(NS(=O)(=O)Cc2ccc(Cl)cc2)c2ccccc2c1O
Show InChI InChI=1S/C19H16ClNO5S2/c20-13-7-5-12(6-8-13)11-28(25,26)21-16-9-17(27-10-18(22)23)19(24)15-4-2-1-3-14(15)16/h1-9,21,24H,10-11H2,(H,22,23)
NCI pathway
5.23E+3n/an/an/an/an/an/an/an/a
University of Michigan Medical School
Curated by ChEMBL
Assay Description
Displacement of Flu-BID/FAM-BID from His-tagged MCL1 (171 to 327) (unknown origin) expressed in Escherichia coli BL21(DE3) after 3 hrs by fluorescenc...
J Med Chem 57: 4111-33 (2014)
Article DOI: 10.1021/jm500010b
BindingDB Entry DOI: 10.7270/Q20003NC
Induced myeloid leukemia cell differentiation protein Mcl-1
(Homo sapiens (Human))
BDBM50013872
(CHEMBL3265303)
Show SMILES OC(=O)CSc1cc(NS(=O)(=O)Cc2ccc(Cl)cc2)c2ccccc2c1O
Show InChI InChI=1S/C19H16ClNO5S2/c20-13-7-5-12(6-8-13)11-28(25,26)21-16-9-17(27-10-18(22)23)19(24)15-4-2-1-3-14(15)16/h1-9,21,24H,10-11H2,(H,22,23)
NCI pathway
n/an/a 9.59E+3n/an/an/an/an/an/a
University of Michigan Medical School
Curated by ChEMBL
Assay Description
Binding affinity to His-tagged MCL1 (171 to 327) (unknown origin) expressed in Escherichia coli BL21(DE3) assessed as inhibition of MCL1-N-terminal b...
J Med Chem 57: 4111-33 (2014)
Article DOI: 10.1021/jm500010b
BindingDB Entry DOI: 10.7270/Q20003NC