BDBM50013879 CHEMBL3265310
SMILES: NC(=O)CSc1cc(NS(=O)(=O)c2ccc(Br)cc2)c2ccccc2c1O
InChI Key: InChIKey=WBAIUBIBYMOTDJ-UHFFFAOYSA-N
Data: 1 KI  1 IC50
Activity Spreadsheet -- Enzyme Inhibition Constant Data from BindingDB
Found 2 hits for monomerid = 50013879
Trg + Lig
Ki
nM
ΔG°
kcal/mole
IC50
nM
Kd
nM
EC50/IC50
nM
koff
s-1
kon
M-1s-1
pHTemp
°C
Induced myeloid leukemia cell differentiation protein Mcl-1
(Homo sapiens (Human))
BDBM50013879
(CHEMBL3265310)
Show SMILES NC(=O)CSc1cc(NS(=O)(=O)c2ccc(Br)cc2)c2ccccc2c1O
Show InChI InChI=1S/C18H15BrN2O4S2/c19-11-5-7-12(8-6-11)27(24,25)21-15-9-16(26-10-17(20)22)18(23)14-4-2-1-3-13(14)15/h1-9,21,23H,10H2,(H2,20,22)
NCI pathway
1.71E+3n/an/an/an/an/an/an/an/a
University of Michigan Medical School
Curated by ChEMBL
Assay Description
Displacement of Flu-BID/FAM-BID from His-tagged MCL1 (171 to 327) (unknown origin) expressed in Escherichia coli BL21(DE3) after 3 hrs by fluorescenc...
J Med Chem 57: 4111-33 (2014)
Article DOI: 10.1021/jm500010b
BindingDB Entry DOI: 10.7270/Q20003NC
Induced myeloid leukemia cell differentiation protein Mcl-1
(Homo sapiens (Human))
BDBM50013879
(CHEMBL3265310)
Show SMILES NC(=O)CSc1cc(NS(=O)(=O)c2ccc(Br)cc2)c2ccccc2c1O
Show InChI InChI=1S/C18H15BrN2O4S2/c19-11-5-7-12(8-6-11)27(24,25)21-15-9-16(26-10-17(20)22)18(23)14-4-2-1-3-13(14)15/h1-9,21,23H,10H2,(H2,20,22)
NCI pathway
n/an/a 3.87E+3n/an/an/an/an/an/a
University of Michigan Medical School
Curated by ChEMBL
Assay Description
Binding affinity to His-tagged MCL1 (171 to 327) (unknown origin) expressed in Escherichia coli BL21(DE3) assessed as inhibition of MCL1-N-terminal b...
J Med Chem 57: 4111-33 (2014)
Article DOI: 10.1021/jm500010b
BindingDB Entry DOI: 10.7270/Q20003NC