null
SMILES: CCCCCc1c(\C=C\C(=O)N[C@@H](CC)CCCc2cccnc2)n(C)c2cc(OC)ccc12
InChI Key: InChIKey=FGERDALIPXYEDP-SQAMQDMYSA-N
Activity Spreadsheet -- Enzyme Inhibition Constant Data from BindingDB
Found 1 hit for monomerid = 50013926
Trg + Lig
Ki
nM
ΔG°
kcal/mole
IC50
nM
Kd
nM
EC50/IC50
nM
koff
s-1
kon
M-1s-1
pHTemp
°C
Platelet-activating factor receptor
(Homo sapiens (Human))
BDBM50013926
(CHEMBL319384 | N-(1-Ethyl-4-pyridin-3-yl-butyl)-3-...)
Show SMILES CCCCCc1c(\C=C\C(=O)N[C@@H](CC)CCCc2cccnc2)n(C)c2cc(OC)ccc12
Show InChI InChI=1S/C29H39N3O2/c1-5-7-8-14-25-26-16-15-24(34-4)20-28(26)32(3)27(25)17-18-29(33)31-23(6-2)13-9-11-22-12-10-19-30-21-22/h10,12,15-21,23H,5-9,11,13-14H2,1-4H3,(H,31,33)/b18-17+/t23-/m0/s1
Reactome pathway
n/an/a 26n/an/an/an/an/an/a
Hoffmann-La Roche Inc.
Curated by ChEMBL
Assay Description
Inhibition of [3H]-PAF binding to platelet activating factor receptor citrate-treated dog blood
J Med Chem 33: 2856-64 (1990)
BindingDB Entry DOI: 10.7270/Q21V5CZJ