null
SMILES: OC[C@@H](O)CNC(=O)c1ncncc1Nc1ccc(I)cc1F
InChI Key: InChIKey=UDNBJJYTYGBAIK-VIFPVBQESA-N
Activity Spreadsheet -- Enzyme Inhibition Constant Data from BindingDB
Found 2 hits for monomerid = 50014414
Trg + Lig
Ki
nM
ΔG°
kcal/mole
IC50
nM
Kd
nM
EC50/IC50
nM
koff
s-1
kon
M-1s-1
pHTemp
°C
Dual specificity mitogen-activated protein kinase kinase 1
(Homo sapiens (Human))
BDBM50014414
(CHEMBL3261144)
Show SMILES OC[C@@H](O)CNC(=O)c1ncncc1Nc1ccc(I)cc1F |r|
Show InChI InChI=1S/C14H14FIN4O3/c15-10-3-8(16)1-2-11(10)20-12-5-17-7-19-13(12)14(23)18-4-9(22)6-21/h1-3,5,7,9,20-22H,4,6H2,(H,18,23)/t9-/m0/s1
Reactome pathway
n/an/a 5.40n/an/an/an/an/an/a
Shanghai Hengrui Pharmaceutical Co., Ltd
Curated by ChEMBL
Assay Description
Inhibition of MEK1 (unknown origin)
Bioorg Med Chem Lett 24: 2555-9 (2014)
Article DOI: 10.1016/j.bmcl.2014.03.086
BindingDB Entry DOI: 10.7270/Q2PG1T73
Dual specificity mitogen-activated protein kinase kinase 1
(Homo sapiens (Human))
BDBM50014414
(CHEMBL3261144)
Show SMILES OC[C@@H](O)CNC(=O)c1ncncc1Nc1ccc(I)cc1F |r|
Show InChI InChI=1S/C14H14FIN4O3/c15-10-3-8(16)1-2-11(10)20-12-5-17-7-19-13(12)14(23)18-4-9(22)6-21/h1-3,5,7,9,20-22H,4,6H2,(H,18,23)/t9-/m0/s1
Reactome pathway
n/an/a 3.40n/an/an/an/an/an/a
Shanghai Hengrui Pharmaceutical Co., Ltd
Curated by ChEMBL
Assay Description
Inhibition of MEK1 in human COLO205 cells
Bioorg Med Chem Lett 24: 2555-9 (2014)
Article DOI: 10.1016/j.bmcl.2014.03.086
BindingDB Entry DOI: 10.7270/Q2PG1T73