BDBM50014433 CHEMBL3261425
SMILES: C[C@@H](CNc1cccc2n(ncc12)-c1ccc(F)nc1)NS(=O)(=O)c1c(C)nn(C2CCCC2)c1C
InChI Key: InChIKey=NUUMMLYSKRRLTQ-INIZCTEOSA-N
Data: 14 IC50
Activity Spreadsheet -- Enzyme Inhibition Constant Data from BindingDB
Found 14 hits for monomerid = 50014433
Trg + Lig
Ki
nM
ΔG°
kcal/mole
IC50
nM
Kd
nM
EC50/IC50
nM
koff
s-1
kon
M-1s-1
pHTemp
°C
Glucocorticoid receptor
(Homo sapiens (Human))
BDBM50014433
(CHEMBL3261425)
Show SMILES C[C@@H](CNc1cccc2n(ncc12)-c1ccc(F)nc1)NS(=O)(=O)c1c(C)nn(C2CCCC2)c1C |r|
Show InChI InChI=1S/C25H30FN7O2S/c1-16(31-36(34,35)25-17(2)30-32(18(25)3)19-7-4-5-8-19)13-27-22-9-6-10-23-21(22)15-29-33(23)20-11-12-24(26)28-14-20/h6,9-12,14-16,19,27,31H,4-5,7-8,13H2,1-3H3/t16-/m0/s1
n/an/a 14n/an/an/an/an/an/a
AstraZeneca
Curated by ChEMBL
Assay Description
Agonist activity at glucocorticoid receptor in human PBMC assessed as inhibition of LPS-stimulated TNF-alpha release
Bioorg Med Chem Lett 24: 2571-7 (2014)
Article DOI: 10.1016/j.bmcl.2014.03.070
BindingDB Entry DOI: 10.7270/Q2JQ12J6
Cytochrome P450 2C9
(Homo sapiens (Human))
BDBM50014433
(CHEMBL3261425)
Show SMILES C[C@@H](CNc1cccc2n(ncc12)-c1ccc(F)nc1)NS(=O)(=O)c1c(C)nn(C2CCCC2)c1C |r|
Show InChI InChI=1S/C25H30FN7O2S/c1-16(31-36(34,35)25-17(2)30-32(18(25)3)19-7-4-5-8-19)13-27-22-9-6-10-23-21(22)15-29-33(23)20-11-12-24(26)28-14-20/h6,9-12,14-16,19,27,31H,4-5,7-8,13H2,1-3H3/t16-/m0/s1
Reactome pathway
n/an/a 1.70E+4n/an/an/an/an/an/a
AstraZeneca
Curated by ChEMBL
Assay Description
Inhibition of CYP2C9 (unknown origin)
Bioorg Med Chem Lett 24: 2571-7 (2014)
Article DOI: 10.1016/j.bmcl.2014.03.070
BindingDB Entry DOI: 10.7270/Q2JQ12J6
Cytochrome P450 2D6
(Homo sapiens (Human))
BDBM50014433
(CHEMBL3261425)
Show SMILES C[C@@H](CNc1cccc2n(ncc12)-c1ccc(F)nc1)NS(=O)(=O)c1c(C)nn(C2CCCC2)c1C |r|
Show InChI InChI=1S/C25H30FN7O2S/c1-16(31-36(34,35)25-17(2)30-32(18(25)3)19-7-4-5-8-19)13-27-22-9-6-10-23-21(22)15-29-33(23)20-11-12-24(26)28-14-20/h6,9-12,14-16,19,27,31H,4-5,7-8,13H2,1-3H3/t16-/m0/s1
n/an/a>2.00E+4n/an/an/an/an/an/a
AstraZeneca
Curated by ChEMBL
Assay Description
Inhibition of CYP2D6 (unknown origin)
Bioorg Med Chem Lett 24: 2571-7 (2014)
Article DOI: 10.1016/j.bmcl.2014.03.070
BindingDB Entry DOI: 10.7270/Q2JQ12J6
Cytochrome P450 1A
(Homo sapiens (Human))
BDBM50014433
(CHEMBL3261425)
Show SMILES C[C@@H](CNc1cccc2n(ncc12)-c1ccc(F)nc1)NS(=O)(=O)c1c(C)nn(C2CCCC2)c1C |r|
Show InChI InChI=1S/C25H30FN7O2S/c1-16(31-36(34,35)25-17(2)30-32(18(25)3)19-7-4-5-8-19)13-27-22-9-6-10-23-21(22)15-29-33(23)20-11-12-24(26)28-14-20/h6,9-12,14-16,19,27,31H,4-5,7-8,13H2,1-3H3/t16-/m0/s1
Reactome pathway
n/an/a>2.00E+4n/an/an/an/an/an/a
AstraZeneca
Curated by ChEMBL
Assay Description
Inhibition of CYP1A2 (unknown origin)
Bioorg Med Chem Lett 24: 2571-7 (2014)
Article DOI: 10.1016/j.bmcl.2014.03.070
BindingDB Entry DOI: 10.7270/Q2JQ12J6
Cytochrome P450 2C19
(Homo sapiens (Human))
BDBM50014433
(CHEMBL3261425)
Show SMILES C[C@@H](CNc1cccc2n(ncc12)-c1ccc(F)nc1)NS(=O)(=O)c1c(C)nn(C2CCCC2)c1C |r|
Show InChI InChI=1S/C25H30FN7O2S/c1-16(31-36(34,35)25-17(2)30-32(18(25)3)19-7-4-5-8-19)13-27-22-9-6-10-23-21(22)15-29-33(23)20-11-12-24(26)28-14-20/h6,9-12,14-16,19,27,31H,4-5,7-8,13H2,1-3H3/t16-/m0/s1
Reactome pathway
n/an/a>2.00E+4n/an/an/an/an/an/a
AstraZeneca
Curated by ChEMBL
Assay Description
Inhibition of CYP2C19 (unknown origin)
Bioorg Med Chem Lett 24: 2571-7 (2014)
Article DOI: 10.1016/j.bmcl.2014.03.070
BindingDB Entry DOI: 10.7270/Q2JQ12J6
Cytochrome P450 3A4
(Homo sapiens (Human))
BDBM50014433
(CHEMBL3261425)
Show SMILES C[C@@H](CNc1cccc2n(ncc12)-c1ccc(F)nc1)NS(=O)(=O)c1c(C)nn(C2CCCC2)c1C |r|
Show InChI InChI=1S/C25H30FN7O2S/c1-16(31-36(34,35)25-17(2)30-32(18(25)3)19-7-4-5-8-19)13-27-22-9-6-10-23-21(22)15-29-33(23)20-11-12-24(26)28-14-20/h6,9-12,14-16,19,27,31H,4-5,7-8,13H2,1-3H3/t16-/m0/s1
Reactome pathway
n/an/a 2.20E+4n/an/an/an/an/an/a
AstraZeneca
Curated by ChEMBL
Assay Description
Inhibition of CYP3A4 (unknown origin)
Bioorg Med Chem Lett 24: 2571-7 (2014)
Article DOI: 10.1016/j.bmcl.2014.03.070
BindingDB Entry DOI: 10.7270/Q2JQ12J6
Glucocorticoid receptor
(Homo sapiens (Human))
BDBM50014433
(CHEMBL3261425)
Show SMILES C[C@@H](CNc1cccc2n(ncc12)-c1ccc(F)nc1)NS(=O)(=O)c1c(C)nn(C2CCCC2)c1C |r|
Show InChI InChI=1S/C25H30FN7O2S/c1-16(31-36(34,35)25-17(2)30-32(18(25)3)19-7-4-5-8-19)13-27-22-9-6-10-23-21(22)15-29-33(23)20-11-12-24(26)28-14-20/h6,9-12,14-16,19,27,31H,4-5,7-8,13H2,1-3H3/t16-/m0/s1
n/an/a 3n/an/an/an/an/an/a
AstraZeneca
Curated by ChEMBL
Assay Description
Binding affinity to human glucocorticoid receptor by fluorescence polarization assay
Bioorg Med Chem Lett 24: 2571-7 (2014)
Article DOI: 10.1016/j.bmcl.2014.03.070
BindingDB Entry DOI: 10.7270/Q2JQ12J6
Glucocorticoid
(RAT)
BDBM50014433
(CHEMBL3261425)
Show SMILES C[C@@H](CNc1cccc2n(ncc12)-c1ccc(F)nc1)NS(=O)(=O)c1c(C)nn(C2CCCC2)c1C |r|
Show InChI InChI=1S/C25H30FN7O2S/c1-16(31-36(34,35)25-17(2)30-32(18(25)3)19-7-4-5-8-19)13-27-22-9-6-10-23-21(22)15-29-33(23)20-11-12-24(26)28-14-20/h6,9-12,14-16,19,27,31H,4-5,7-8,13H2,1-3H3/t16-/m0/s1
n/an/a 4.5n/an/an/an/an/an/a
AstraZeneca
Curated by ChEMBL
Assay Description
Agonist activity at glucocorticoid receptor in rat PBMC assessed as inhibition of LPS-stimulated TNF-alpha release
Bioorg Med Chem Lett 24: 2571-7 (2014)
Article DOI: 10.1016/j.bmcl.2014.03.070
BindingDB Entry DOI: 10.7270/Q2JQ12J6
Mineralocorticoid receptor
(Homo sapiens (Human))
BDBM50014433
(CHEMBL3261425)
Show SMILES C[C@@H](CNc1cccc2n(ncc12)-c1ccc(F)nc1)NS(=O)(=O)c1c(C)nn(C2CCCC2)c1C |r|
Show InChI InChI=1S/C25H30FN7O2S/c1-16(31-36(34,35)25-17(2)30-32(18(25)3)19-7-4-5-8-19)13-27-22-9-6-10-23-21(22)15-29-33(23)20-11-12-24(26)28-14-20/h6,9-12,14-16,19,27,31H,4-5,7-8,13H2,1-3H3/t16-/m0/s1
n/an/a>5.00E+3n/an/an/an/an/an/a
AstraZeneca
Curated by ChEMBL
Assay Description
Binding affinity to mineralocorticoid receptor (unknown origin)
Bioorg Med Chem Lett 24: 2571-7 (2014)
Article DOI: 10.1016/j.bmcl.2014.03.070
BindingDB Entry DOI: 10.7270/Q2JQ12J6
Estrogen receptor
(Homo sapiens (Human))
BDBM50014433
(CHEMBL3261425)
Show SMILES C[C@@H](CNc1cccc2n(ncc12)-c1ccc(F)nc1)NS(=O)(=O)c1c(C)nn(C2CCCC2)c1C |r|
Show InChI InChI=1S/C25H30FN7O2S/c1-16(31-36(34,35)25-17(2)30-32(18(25)3)19-7-4-5-8-19)13-27-22-9-6-10-23-21(22)15-29-33(23)20-11-12-24(26)28-14-20/h6,9-12,14-16,19,27,31H,4-5,7-8,13H2,1-3H3/t16-/m0/s1
n/an/a>5.00E+3n/an/an/an/an/an/a
AstraZeneca
Curated by ChEMBL
Assay Description
Binding affinity to ER-alpha (unknown origin)
Bioorg Med Chem Lett 24: 2571-7 (2014)
Article DOI: 10.1016/j.bmcl.2014.03.070
BindingDB Entry DOI: 10.7270/Q2JQ12J6
Estradiol receptor beta (ERβ)
(Homo sapiens (Human))
BDBM50014433
(CHEMBL3261425)
Show SMILES C[C@@H](CNc1cccc2n(ncc12)-c1ccc(F)nc1)NS(=O)(=O)c1c(C)nn(C2CCCC2)c1C |r|
Show InChI InChI=1S/C25H30FN7O2S/c1-16(31-36(34,35)25-17(2)30-32(18(25)3)19-7-4-5-8-19)13-27-22-9-6-10-23-21(22)15-29-33(23)20-11-12-24(26)28-14-20/h6,9-12,14-16,19,27,31H,4-5,7-8,13H2,1-3H3/t16-/m0/s1
n/an/a>5.00E+3n/an/an/an/an/an/a
AstraZeneca
Curated by ChEMBL
Assay Description
Binding affinity to ER-beta (unknown origin)
Bioorg Med Chem Lett 24: 2571-7 (2014)
Article DOI: 10.1016/j.bmcl.2014.03.070
BindingDB Entry DOI: 10.7270/Q2JQ12J6
Glucocorticoid receptor
(Homo sapiens (Human))
BDBM50014433
(CHEMBL3261425)
Show SMILES C[C@@H](CNc1cccc2n(ncc12)-c1ccc(F)nc1)NS(=O)(=O)c1c(C)nn(C2CCCC2)c1C |r|
Show InChI InChI=1S/C25H30FN7O2S/c1-16(31-36(34,35)25-17(2)30-32(18(25)3)19-7-4-5-8-19)13-27-22-9-6-10-23-21(22)15-29-33(23)20-11-12-24(26)28-14-20/h6,9-12,14-16,19,27,31H,4-5,7-8,13H2,1-3H3/t16-/m0/s1
n/an/a 7.20n/an/an/an/an/an/a
AstraZeneca
Curated by ChEMBL
Assay Description
Agonist activity at glucocorticoid receptor in human Chago K1 cells assessed as gene transrepression by Lac-Z reporter gene assay
Bioorg Med Chem Lett 24: 2571-7 (2014)
Article DOI: 10.1016/j.bmcl.2014.03.070
BindingDB Entry DOI: 10.7270/Q2JQ12J6
Androgen Receptor
(Homo sapiens (Human))
BDBM50014433
(CHEMBL3261425)
Show SMILES C[C@@H](CNc1cccc2n(ncc12)-c1ccc(F)nc1)NS(=O)(=O)c1c(C)nn(C2CCCC2)c1C |r|
Show InChI InChI=1S/C25H30FN7O2S/c1-16(31-36(34,35)25-17(2)30-32(18(25)3)19-7-4-5-8-19)13-27-22-9-6-10-23-21(22)15-29-33(23)20-11-12-24(26)28-14-20/h6,9-12,14-16,19,27,31H,4-5,7-8,13H2,1-3H3/t16-/m0/s1
NCI pathway
Reactome pathway
n/an/a>1.00E+3n/an/an/an/an/an/a
AstraZeneca
Curated by ChEMBL
Assay Description
Binding affinity to androgen receptor (unknown origin)
Bioorg Med Chem Lett 24: 2571-7 (2014)
Article DOI: 10.1016/j.bmcl.2014.03.070
BindingDB Entry DOI: 10.7270/Q2JQ12J6
Progesterone receptor
(Homo sapiens (Human))
BDBM50014433
(CHEMBL3261425)
Show SMILES C[C@@H](CNc1cccc2n(ncc12)-c1ccc(F)nc1)NS(=O)(=O)c1c(C)nn(C2CCCC2)c1C |r|
Show InChI InChI=1S/C25H30FN7O2S/c1-16(31-36(34,35)25-17(2)30-32(18(25)3)19-7-4-5-8-19)13-27-22-9-6-10-23-21(22)15-29-33(23)20-11-12-24(26)28-14-20/h6,9-12,14-16,19,27,31H,4-5,7-8,13H2,1-3H3/t16-/m0/s1
n/an/a 4.50E+3n/an/an/an/an/an/a
AstraZeneca
Curated by ChEMBL
Assay Description
Binding affinity to progesterone receptor (unknown origin)
Bioorg Med Chem Lett 24: 2571-7 (2014)
Article DOI: 10.1016/j.bmcl.2014.03.070
BindingDB Entry DOI: 10.7270/Q2JQ12J6