BDBM50014506 (S)-2-(4-(ethyl((2-methyl-4-oxo-3,4-dihydroquinazolin-6-yl)methyl)amino)-2-fluorobenzamido)pentanedioic acid::2-{4-[Ethyl-(2-methyl-4-oxo-3,4-dihydro-quinazolin-6-ylmethyl)-amino]-2-fluoro-benzoylamino}-pentanedioic acid::CHEMBL104856
SMILES: CCN(Cc1ccc2nc(C)[nH]c(=O)c2c1)c1ccc(C(=O)N[C@@H](CCC(O)=O)C(O)=O)c(F)c1
InChI Key: InChIKey=LFQSCBTYLOQLNI-FQEVSTJZSA-N
Data: 2 IC50
Activity Spreadsheet -- Enzyme Inhibition Constant Data from BindingDB
Found 2 hits for monomerid = 50014506
Trg + Lig
Ki
nM
ΔG°
kcal/mole
IC50
nM
Kd
nM
EC50/IC50
nM
koff
s-1
kon
M-1s-1
pHTemp
°C
Thymidylate synthase
(Homo sapiens (Human))
BDBM50014506
((S)-2-(4-(ethyl((2-methyl-4-oxo-3,4-dihydroquinazo...)
Show SMILES CCN(Cc1ccc2nc(C)[nH]c(=O)c2c1)c1ccc(C(=O)N[C@@H](CCC(O)=O)C(O)=O)c(F)c1
Show InChI InChI=1S/C24H25FN4O6/c1-3-29(12-14-4-7-19-17(10-14)23(33)27-13(2)26-19)15-5-6-16(18(25)11-15)22(32)28-20(24(34)35)8-9-21(30)31/h4-7,10-11,20H,3,8-9,12H2,1-2H3,(H,28,32)(H,30,31)(H,34,35)(H,26,27,33)/t20-/m0/s1
NCI pathway
Reactome pathway
n/an/a 45n/an/an/an/an/an/a
Meerut Institute of Engineering and Technology
Curated by ChEMBL
Assay Description
Inhibition of thymidylate synthase
Eur J Med Chem 45: 1560-71 (2010)
Article DOI: 10.1016/j.ejmech.2009.12.065
BindingDB Entry DOI: 10.7270/Q2D50P61
Thymidylate synthase
(Mus musculus)
BDBM50014506
((S)-2-(4-(ethyl((2-methyl-4-oxo-3,4-dihydroquinazo...)
Show SMILES CCN(Cc1ccc2nc(C)[nH]c(=O)c2c1)c1ccc(C(=O)N[C@@H](CCC(O)=O)C(O)=O)c(F)c1
Show InChI InChI=1S/C24H25FN4O6/c1-3-29(12-14-4-7-19-17(10-14)23(33)27-13(2)26-19)15-5-6-16(18(25)11-15)22(32)28-20(24(34)35)8-9-21(30)31/h4-7,10-11,20H,3,8-9,12H2,1-2H3,(H,28,32)(H,30,31)(H,34,35)(H,26,27,33)/t20-/m0/s1
Reactome pathway
n/an/a 45n/an/an/an/an/an/a
ICI Pharmaceuticals
Curated by ChEMBL
Assay Description
Inhibition of partially purified thymidylate synthase (TS)
J Med Chem 33: 3072-8 (1990)
BindingDB Entry DOI: 10.7270/Q2QC02G1