BDBM50014709 CHEMBL3262018::US10759791, Compound 3R::US9951014, Name 3R
SMILES: Cc1cc(N)nc(CCc2cccc(c2)[C@H](N)Cc2cc(C)cc(N)n2)c1
InChI Key: InChIKey=HPGDXHOKQNTRIC-HXUWFJFHSA-N
Data: 9 KI  1 Kd
PDB links: 3 PDB IDs match this monomer.
Activity Spreadsheet -- Enzyme Inhibition Constant Data from BindingDB
Found 10 hits for monomerid = 50014709
Trg + Lig
Ki
nM
ΔG°
kcal/mole
IC50
nM
Kd
nM
EC50/IC50
nM
koff
s-1
kon
M-1s-1
pHTemp
°C
Nitric oxide synthase, brain
(Homo sapiens (Human))
BDBM50014709
(CHEMBL3262018 | US10759791, Compound 3R | US995101...)
Show SMILES Cc1cc(N)nc(CCc2cccc(c2)[C@H](N)Cc2cc(C)cc(N)n2)c1 |r|
Show InChI InChI=1S/C22H27N5/c1-14-8-18(26-21(24)10-14)7-6-16-4-3-5-17(12-16)20(23)13-19-9-15(2)11-22(25)27-19/h3-5,8-12,20H,6-7,13,23H2,1-2H3,(H2,24,26)(H2,25,27)/t20-/m1/s1
Reactome pathway
US Patent
122n/an/an/an/an/an/an/an/a
Astex
Assay Description
The NOSs isoform assays involved subjecting 3-8 to an oxyhemoglobin NO capture assay using a Biotek Gen5™ microplate reader. IC50 values for each com...
J Med Chem 52: 379-88 (2009)
BindingDB Entry DOI: 10.7270/Q21N83G1
3D
3D Structure (crystal)
Nitric-oxide synthase, brain
(Rattus norvegicus (rat))
BDBM50014709
(CHEMBL3262018 | US10759791, Compound 3R | US995101...)
Show SMILES Cc1cc(N)nc(CCc2cccc(c2)[C@H](N)Cc2cc(C)cc(N)n2)c1 |r|
Show InChI InChI=1S/C22H27N5/c1-14-8-18(26-21(24)10-14)7-6-16-4-3-5-17(12-16)20(23)13-19-9-15(2)11-22(25)27-19/h3-5,8-12,20H,6-7,13,23H2,1-2H3,(H2,24,26)(H2,25,27)/t20-/m1/s1
US Patent
122n/an/an/an/an/an/an/an/a
Northwestern University
US Patent
Assay Description
Enzyme inhibition was evaluated by measuring NO production with the hemoglobin capture assay, which was performed with purified NOSs in 96-well plate...
US Patent US10759791 (2020)
3D
3D Structure (crystal)
Nitric-oxide synthase, brain
(Rattus norvegicus (rat))
BDBM50014709
(CHEMBL3262018 | US10759791, Compound 3R | US995101...)
Show SMILES Cc1cc(N)nc(CCc2cccc(c2)[C@H](N)Cc2cc(C)cc(N)n2)c1 |r|
Show InChI InChI=1S/C22H27N5/c1-14-8-18(26-21(24)10-14)7-6-16-4-3-5-17(12-16)20(23)13-19-9-15(2)11-22(25)27-19/h3-5,8-12,20H,6-7,13,23H2,1-2H3,(H2,24,26)(H2,25,27)/t20-/m1/s1
122n/an/an/an/an/an/an/an/a
Northwestern University
Curated by ChEMBL
Assay Description
Inhibition of purified rat nNOS assessed as inhibition of nitric oxide-mediated oxidation of hemoglobin-A by hemoglobin capture assay
J Med Chem 57: 4382-96 (2014)
Article DOI: 10.1021/jm5004182
BindingDB Entry DOI: 10.7270/Q21R6S26
3D
3D Structure (crystal)
Nitric Oxide Synthase, endothelial
(Bos taurus (bovine))
BDBM50014709
(CHEMBL3262018 | US10759791, Compound 3R | US995101...)
Show SMILES Cc1cc(N)nc(CCc2cccc(c2)[C@H](N)Cc2cc(C)cc(N)n2)c1 |r|
Show InChI InChI=1S/C22H27N5/c1-14-8-18(26-21(24)10-14)7-6-16-4-3-5-17(12-16)20(23)13-19-9-15(2)11-22(25)27-19/h3-5,8-12,20H,6-7,13,23H2,1-2H3,(H2,24,26)(H2,25,27)/t20-/m1/s1
1.44E+4n/an/an/an/an/an/an/an/a
Northwestern University
Curated by ChEMBL
Assay Description
Inhibition of purified bovine eNOS assessed as inhibition of nitric oxide-mediated oxidation of hemoglobin-A by hemoglobin capture assay
J Med Chem 57: 4382-96 (2014)
Article DOI: 10.1021/jm5004182
BindingDB Entry DOI: 10.7270/Q21R6S26
3D
3D Structure (crystal)
Nitric-oxide synthase, endothelial
(Bos taurus (bovine))
BDBM50014709
(CHEMBL3262018 | US10759791, Compound 3R | US995101...)
Show SMILES Cc1cc(N)nc(CCc2cccc(c2)[C@H](N)Cc2cc(C)cc(N)n2)c1 |r|
Show InChI InChI=1S/C22H27N5/c1-14-8-18(26-21(24)10-14)7-6-16-4-3-5-17(12-16)20(23)13-19-9-15(2)11-22(25)27-19/h3-5,8-12,20H,6-7,13,23H2,1-2H3,(H2,24,26)(H2,25,27)/t20-/m1/s1
US Patent
1.44E+4n/an/an/an/an/an/an/an/a
Northwestern University
US Patent
Assay Description
Enzyme inhibition was evaluated by measuring NO production with the hemoglobin capture assay, which was performed with purified NOSs in 96-well plate...
US Patent US10759791 (2020)
3D
3D Structure (crystal)
Nitric oxide synthase, endothelial
(Homo sapiens (Human))
BDBM50014709
(CHEMBL3262018 | US10759791, Compound 3R | US995101...)
Show SMILES Cc1cc(N)nc(CCc2cccc(c2)[C@H](N)Cc2cc(C)cc(N)n2)c1 |r|
Show InChI InChI=1S/C22H27N5/c1-14-8-18(26-21(24)10-14)7-6-16-4-3-5-17(12-16)20(23)13-19-9-15(2)11-22(25)27-19/h3-5,8-12,20H,6-7,13,23H2,1-2H3,(H2,24,26)(H2,25,27)/t20-/m1/s1
US Patent
1.44E+4n/an/an/an/an/an/an/an/a
Astex
Assay Description
The NOSs isoform assays involved subjecting 3-8 to an oxyhemoglobin NO capture assay using a Biotek Gen5™ microplate reader. IC50 values for each com...
J Med Chem 52: 379-88 (2009)
BindingDB Entry DOI: 10.7270/Q21N83G1
3D
3D Structure (crystal)
Nitric oxide synthase, inducible
(Homo sapiens (Human))
BDBM50014709
(CHEMBL3262018 | US10759791, Compound 3R | US995101...)
Show SMILES Cc1cc(N)nc(CCc2cccc(c2)[C@H](N)Cc2cc(C)cc(N)n2)c1 |r|
Show InChI InChI=1S/C22H27N5/c1-14-8-18(26-21(24)10-14)7-6-16-4-3-5-17(12-16)20(23)13-19-9-15(2)11-22(25)27-19/h3-5,8-12,20H,6-7,13,23H2,1-2H3,(H2,24,26)(H2,25,27)/t20-/m1/s1
NCI pathway
Reactome pathway
US Patent
1.56E+4n/an/an/an/an/an/an/an/a
Astex
Assay Description
The NOSs isoform assays involved subjecting 3-8 to an oxyhemoglobin NO capture assay using a Biotek Gen5™ microplate reader. IC50 values for each com...
J Med Chem 52: 379-88 (2009)
BindingDB Entry DOI: 10.7270/Q21N83G1
Nitric Oxide Synthase, inducible
(Mus musculus (mouse))
BDBM50014709
(CHEMBL3262018 | US10759791, Compound 3R | US995101...)
Show SMILES Cc1cc(N)nc(CCc2cccc(c2)[C@H](N)Cc2cc(C)cc(N)n2)c1 |r|
Show InChI InChI=1S/C22H27N5/c1-14-8-18(26-21(24)10-14)7-6-16-4-3-5-17(12-16)20(23)13-19-9-15(2)11-22(25)27-19/h3-5,8-12,20H,6-7,13,23H2,1-2H3,(H2,24,26)(H2,25,27)/t20-/m1/s1
Reactome pathway
1.56E+4n/an/an/an/an/an/an/an/a
Northwestern University
Curated by ChEMBL
Assay Description
Inhibition of purified mouse iNOS assessed as inhibition of nitric oxide-mediated oxidation of hemoglobin-A by hemoglobin capture assay
J Med Chem 57: 4382-96 (2014)
Article DOI: 10.1021/jm5004182
BindingDB Entry DOI: 10.7270/Q21R6S26
Nitric oxide synthase, inducible
(Mus musculus (mouse))
BDBM50014709
(CHEMBL3262018 | US10759791, Compound 3R | US995101...)
Show SMILES Cc1cc(N)nc(CCc2cccc(c2)[C@H](N)Cc2cc(C)cc(N)n2)c1 |r|
Show InChI InChI=1S/C22H27N5/c1-14-8-18(26-21(24)10-14)7-6-16-4-3-5-17(12-16)20(23)13-19-9-15(2)11-22(25)27-19/h3-5,8-12,20H,6-7,13,23H2,1-2H3,(H2,24,26)(H2,25,27)/t20-/m1/s1
Reactome pathway
US Patent
1.56E+4n/an/an/an/an/an/an/an/a
Northwestern University
US Patent
Assay Description
Enzyme inhibition was evaluated by measuring NO production with the hemoglobin capture assay, which was performed with purified NOSs in 96-well plate...
US Patent US10759791 (2020)
Nitric oxide synthase (bsNOS)
(Bacillus subtilis (Firmicutes))
BDBM50014709
(CHEMBL3262018 | US10759791, Compound 3R | US995101...)
Show SMILES Cc1cc(N)nc(CCc2cccc(c2)[C@H](N)Cc2cc(C)cc(N)n2)c1 |r|
Show InChI InChI=1S/C22H27N5/c1-14-8-18(26-21(24)10-14)7-6-16-4-3-5-17(12-16)20(23)13-19-9-15(2)11-22(25)27-19/h3-5,8-12,20H,6-7,13,23H2,1-2H3,(H2,24,26)(H2,25,27)/t20-/m1/s1
n/an/an/a 2.56E+4n/an/an/an/an/a
University of California, Irvine
Assay Description
In short, the difference between the imidazole-bound low-spin peak at 430 nm and the inhibitorbound high-spin peak at 395 nm was measured as a functi...
Biochemistry 54: 4075-82 (2015)
Article DOI: 10.1021/acs.biochem.5b00431
BindingDB Entry DOI: 10.7270/Q2Q23Z0J
3D
3D Structure (crystal)