BDBM50014908 4-(2-Chloro-3-trifluoromethyl-phenyl)-2-imidazol-1-ylmethyl-6-methyl-1,4-dihydro-pyridine-3,5-dicarboxylic acid 3-ethyl ester 5-methyl ester : (succinate)::CHEMBL351385
SMILES: CCOC(=O)C1=C(Cn2ccnc2)N=C(C)C(C1c1cccc(c1Cl)C(F)(F)F)C(=O)OC
InChI Key: InChIKey=DAZUMWBSSONIGJ-UHFFFAOYSA-N
Data: 1 IC50
Activity Spreadsheet -- Enzyme Inhibition Constant Data from BindingDB
Found 1 hit for monomerid = 50014908
Trg + Lig
Ki
nM
ΔG°
kcal/mole
IC50
nM
Kd
nM
EC50/IC50
nM
koff
s-1
kon
M-1s-1
pHTemp
°C
Thromboxane A2 Synthase (P450 TxA2)
(Homo sapiens (Human))
BDBM50014908
(4-(2-Chloro-3-trifluoromethyl-phenyl)-2-imidazol-1...)
Show SMILES CCOC(=O)C1=C(Cn2ccnc2)N=C(C)C(C1c1cccc(c1Cl)C(F)(F)F)C(=O)OC |c:5,t:14|
Show InChI InChI=1S/C22H21ClF3N3O4/c1-4-33-21(31)18-15(10-29-9-8-27-11-29)28-12(2)16(20(30)32-3)17(18)13-6-5-7-14(19(13)23)22(24,25)26/h5-9,11,16-17H,4,10H2,1-3H3
n/an/a 1.60E+4n/an/an/an/an/an/a
Wyeth Research UK
Curated by ChEMBL
Assay Description
Inhibition of Thromboxane A2 synthetase after oral administration of 0.03 mmol/kg
J Med Chem 33: 646-52 (1990)
BindingDB Entry DOI: 10.7270/Q25X29HP