BDBM50015540 CHEMBL431348::N-{4-[5-(3-Cyclopentyl-ureido)-1-methyl-1H-indol-3-ylmethyl]-3-methoxy-benzoyl}-2-methyl-benzenesulfonamide
SMILES: COc1cc(ccc1Cc1cn(C)c2ccc(NC(=O)NC3CCCC3)cc12)C(=O)NS(=O)(=O)c1ccccc1C
InChI Key: InChIKey=NCHRUPPPIFNPOD-UHFFFAOYSA-N
Data: 1 KI  1 IC50  1 EC50
Activity Spreadsheet -- Enzyme Inhibition Constant Data from BindingDB
Found 3 hits for monomerid = 50015540
Trg + Lig
Ki
nM
ΔG°
kcal/mole
IC50
nM
Kd
nM
EC50/IC50
nM
koff
s-1
kon
M-1s-1
pHTemp
°C
Cysteinyl leukotriene receptor 1
(GUINEA PIG)
BDBM50015540
(CHEMBL431348 | N-{4-[5-(3-Cyclopentyl-ureido)-1-me...)
Show SMILES COc1cc(ccc1Cc1cn(C)c2ccc(NC(=O)NC3CCCC3)cc12)C(=O)NS(=O)(=O)c1ccccc1C
Show InChI InChI=1S/C31H34N4O5S/c1-20-8-4-7-11-29(20)41(38,39)34-30(36)22-13-12-21(28(17-22)40-3)16-23-19-35(2)27-15-14-25(18-26(23)27)33-31(37)32-24-9-5-6-10-24/h4,7-8,11-15,17-19,24H,5-6,9-10,16H2,1-3H3,(H,34,36)(H2,32,33,37)
1.40n/an/an/an/an/an/an/an/a
ICI Pharmaceuticals Group
Curated by ChEMBL
Assay Description
Displacement of [3H]-LTD4 on guinea pig lung parenchymal membranes
J Med Chem 33: 1781-90 (1990)
BindingDB Entry DOI: 10.7270/Q2862FDP
Peroxisome proliferator-activated receptor
(Homo sapiens (Human))
BDBM50015540
(CHEMBL431348 | N-{4-[5-(3-Cyclopentyl-ureido)-1-me...)
Show SMILES COc1cc(ccc1Cc1cn(C)c2ccc(NC(=O)NC3CCCC3)cc12)C(=O)NS(=O)(=O)c1ccccc1C
Show InChI InChI=1S/C31H34N4O5S/c1-20-8-4-7-11-29(20)41(38,39)34-30(36)22-13-12-21(28(17-22)40-3)16-23-19-35(2)27-15-14-25(18-26(23)27)33-31(37)32-24-9-5-6-10-24/h4,7-8,11-15,17-19,24H,5-6,9-10,16H2,1-3H3,(H,34,36)(H2,32,33,37)
NCI pathway
Reactome pathway
n/an/an/an/a 2.49E+3n/an/an/an/a
Goethe University Frankfurt
Curated by ChEMBL
Assay Description
Partial agonist activity at human PPARgamma LBD expressed HEK293T cells after 12 to 14 hrs by dual-glo luciferase reporter gene assay
J Med Chem 61: 5758-5764 (2018)
Article DOI: 10.1021/acs.jmedchem.8b00458
BindingDB Entry DOI: 10.7270/Q2TX3J21
EBifunctional epoxide hydrolase 2
(Homo sapiens (Human))
BDBM50015540
(CHEMBL431348 | N-{4-[5-(3-Cyclopentyl-ureido)-1-me...)
Show SMILES COc1cc(ccc1Cc1cn(C)c2ccc(NC(=O)NC3CCCC3)cc12)C(=O)NS(=O)(=O)c1ccccc1C
Show InChI InChI=1S/C31H34N4O5S/c1-20-8-4-7-11-29(20)41(38,39)34-30(36)22-13-12-21(28(17-22)40-3)16-23-19-35(2)27-15-14-25(18-26(23)27)33-31(37)32-24-9-5-6-10-24/h4,7-8,11-15,17-19,24H,5-6,9-10,16H2,1-3H3,(H,34,36)(H2,32,33,37)
n/an/a 590n/an/an/an/an/an/a
Goethe University Frankfurt
Curated by ChEMBL
Assay Description
Inhibition of recombinant human sEH using PHOME as substrate preincubated for 30 mins followed by substrate addition and measured after 30 mins by sp...
J Med Chem 61: 5758-5764 (2018)
Article DOI: 10.1021/acs.jmedchem.8b00458
BindingDB Entry DOI: 10.7270/Q2TX3J21