BDBM50015771 1-Ethyl-[1,2,4]triazolo[4,3-a]quinoxalin-4-ylamine::CHEMBL72052
SMILES: CCc1nnc2c(N)nc3ccccc3n12
InChI Key: InChIKey=OCIBVLGWPDAOAZ-UHFFFAOYSA-N
Data: 3 IC50
Activity Spreadsheet -- Enzyme Inhibition Constant Data from BindingDB
Found 3 hits for monomerid = 50015771
Trg + Lig
Ki
nM
ΔG°
kcal/mole
IC50
nM
Kd
nM
EC50/IC50
nM
koff
s-1
kon
M-1s-1
pHTemp
°C
Adenosine receptor A1
(Rattus norvegicus (rat))
BDBM50015771
(1-Ethyl-[1,2,4]triazolo[4,3-a]quinoxalin-4-ylamine...)
Show SMILES CCc1nnc2c(N)nc3ccccc3n12
Show InChI InChI=1S/C11H11N5/c1-2-9-14-15-11-10(12)13-7-5-3-4-6-8(7)16(9)11/h3-6H,2H2,1H3,(H2,12,13)
Reactome pathway
n/an/a 430n/an/an/an/an/an/a
Pfizer Central Research
Curated by ChEMBL
Assay Description
Binding affinity towards the adenosine A1 receptor in cerebral cortices of Sprague-Dawley male rats using [3H]CHA as radioligand.
J Med Chem 33: 2240-54 (1990)
BindingDB Entry DOI: 10.7270/Q2PR7WKF
Phosphodiesterase 1
(Rattus norvegicus)
BDBM50015771
(1-Ethyl-[1,2,4]triazolo[4,3-a]quinoxalin-4-ylamine...)
Show SMILES CCc1nnc2c(N)nc3ccccc3n12
Show InChI InChI=1S/C11H11N5/c1-2-9-14-15-11-10(12)13-7-5-3-4-6-8(7)16(9)11/h3-6H,2H2,1H3,(H2,12,13)
n/an/a 2.00E+3n/an/an/an/an/an/a
Pfizer Central Research
Curated by ChEMBL
Assay Description
Evaluated for Ca++ dependent phosphodiesterase activity.
J Med Chem 33: 2240-54 (1990)
BindingDB Entry DOI: 10.7270/Q2PR7WKF
Adenosine A2 receptor
(Rattus norvegicus-Rattus norvegicus (rat))
BDBM50015771
(1-Ethyl-[1,2,4]triazolo[4,3-a]quinoxalin-4-ylamine...)
Show SMILES CCc1nnc2c(N)nc3ccccc3n12
Show InChI InChI=1S/C11H11N5/c1-2-9-14-15-11-10(12)13-7-5-3-4-6-8(7)16(9)11/h3-6H,2H2,1H3,(H2,12,13)
n/an/a 62n/an/an/an/an/an/a
Pfizer Central Research
Curated by ChEMBL
Assay Description
Evaluated for the binding affinity towards the Adenosine A2 receptor in corpora striata of rats using [3H]NECA as radioligand.
J Med Chem 33: 2240-54 (1990)
BindingDB Entry DOI: 10.7270/Q2PR7WKF