BDBM50016648 5-[5-Chloro-2-(4-chloro-benzylsulfanyl)-phenyl]-imidazolidine-2,4-dione::CHEMBL19789
SMILES: Oc1[nH]c(=O)[nH]c1-c1cc(Cl)ccc1SCc1ccc(Cl)cc1
InChI Key: InChIKey=NUVMBGUAJRRXST-UHFFFAOYSA-N
Data: 1 IC50
Activity Spreadsheet -- Enzyme Inhibition Constant Data from BindingDB
Found 1 hit for monomerid = 50016648
Trg + Lig
Ki
nM
ΔG°
kcal/mole
IC50
nM
Kd
nM
EC50/IC50
nM
koff
s-1
kon
M-1s-1
pHTemp
°C
Aldose reductase (AR)
(Homo sapiens (Human))
BDBM50016648
(5-[5-Chloro-2-(4-chloro-benzylsulfanyl)-phenyl]-im...)
Show SMILES Oc1[nH]c(=O)[nH]c1-c1cc(Cl)ccc1SCc1ccc(Cl)cc1
Show InChI InChI=1S/C16H12Cl2N2O2S/c17-10-3-1-9(2-4-10)8-23-13-6-5-11(18)7-12(13)14-15(21)20-16(22)19-14/h1-7,21H,8H2,(H2,19,20,22)
n/an/a 1.20E+3n/an/an/an/an/an/a
Pfizer Inc.
Curated by ChEMBL
Assay Description
Inhibition of human placental aldose reductase (HPAR) activity with glyceraldehyde as substrate
J Med Chem 32: 1208-13 (1989)
BindingDB Entry DOI: 10.7270/Q24B309G