BDBM50016671 2-(4-Benzyloxy-phenyl)-N-hydroxy-N-(1-phenyl-ethyl)-acetamide::CHEMBL444315
SMILES: CC(N(O)C(=O)Cc1ccc(OCc2ccccc2)cc1)c1ccccc1
InChI Key: InChIKey=KIVFPBKYCHSFMG-UHFFFAOYSA-N
Data: 4 IC50
Activity Spreadsheet -- Enzyme Inhibition Constant Data from BindingDB
Found 4 hits for monomerid = 50016671
Trg + Lig
Ki
nM
ΔG°
kcal/mole
IC50
nM
Kd
nM
EC50/IC50
nM
koff
s-1
kon
M-1s-1
pHTemp
°C
Arachidonate 12-lipoxygenase
(Rattus norvegicus)
BDBM50016671
(2-(4-Benzyloxy-phenyl)-N-hydroxy-N-(1-phenyl-ethyl...)
Show SMILES CC(N(O)C(=O)Cc1ccc(OCc2ccccc2)cc1)c1ccccc1
Show InChI InChI=1S/C23H23NO3/c1-18(21-10-6-3-7-11-21)24(26)23(25)16-19-12-14-22(15-13-19)27-17-20-8-4-2-5-9-20/h2-15,18,26H,16-17H2,1H3
Reactome pathway
n/an/a 6.50E+4n/an/an/an/an/an/a
Rorer Central Research
Curated by ChEMBL
Assay Description
Invitro inhibition of rat platelet 12-lipoxygenase
J Med Chem 32: 1836-42 (1989)
BindingDB Entry DOI: 10.7270/Q2VT1R21
Arachidonate 5-lipoxygenase
(Homo sapiens (Human))
BDBM50016671
(2-(4-Benzyloxy-phenyl)-N-hydroxy-N-(1-phenyl-ethyl...)
Show SMILES CC(N(O)C(=O)Cc1ccc(OCc2ccccc2)cc1)c1ccccc1
Show InChI InChI=1S/C23H23NO3/c1-18(21-10-6-3-7-11-21)24(26)23(25)16-19-12-14-22(15-13-19)27-17-20-8-4-2-5-9-20/h2-15,18,26H,16-17H2,1H3
Reactome pathway
n/an/a 400n/an/an/an/an/an/a
Rorer Central Research
Curated by ChEMBL
Assay Description
In vitro inhibition of polymorphonuclear leukocyte derived human 5-lipoxygenase
J Med Chem 32: 1836-42 (1989)
BindingDB Entry DOI: 10.7270/Q2VT1R21
Arachidonate 5-lipoxygenase
(Homo sapiens (Human))
BDBM50016671
(2-(4-Benzyloxy-phenyl)-N-hydroxy-N-(1-phenyl-ethyl...)
Show SMILES CC(N(O)C(=O)Cc1ccc(OCc2ccccc2)cc1)c1ccccc1
Show InChI InChI=1S/C23H23NO3/c1-18(21-10-6-3-7-11-21)24(26)23(25)16-19-12-14-22(15-13-19)27-17-20-8-4-2-5-9-20/h2-15,18,26H,16-17H2,1H3
Reactome pathway
n/an/a 30n/an/an/an/an/an/a
Rorer Central Research
Curated by ChEMBL
Assay Description
Inhibitory activity against polymorphonuclear leukocyte 5-lipoxygenase using guinea pig supernatant
J Med Chem 32: 1836-42 (1989)
BindingDB Entry DOI: 10.7270/Q2VT1R21
Arachidonate 5-lipoxygenase
(Rattus norvegicus)
BDBM50016671
(2-(4-Benzyloxy-phenyl)-N-hydroxy-N-(1-phenyl-ethyl...)
Show SMILES CC(N(O)C(=O)Cc1ccc(OCc2ccccc2)cc1)c1ccccc1
Show InChI InChI=1S/C23H23NO3/c1-18(21-10-6-3-7-11-21)24(26)23(25)16-19-12-14-22(15-13-19)27-17-20-8-4-2-5-9-20/h2-15,18,26H,16-17H2,1H3
n/an/a 300n/an/an/an/an/an/a
Rorer Central Research
Curated by ChEMBL
Assay Description
In vitro inhibition of rat polymorphonuclear leukocyte 5-lipoxygenase
J Med Chem 32: 1836-42 (1989)
BindingDB Entry DOI: 10.7270/Q2VT1R21