BDBM50016884 1-Propyl-2,3,4,4a,10,10a-hexahydro-1H-9-oxa-1-aza-phenanthren-8-ol::CHEMBL162170
SMILES: CCCN1CCC[C@H]2[C@H]1COc1c(O)cccc21
InChI Key: InChIKey=BJMSUUATNLDQQZ-DGCLKSJQSA-N
Data: 5 IC50
Activity Spreadsheet -- Enzyme Inhibition Constant Data from BindingDB
Found 5 hits for monomerid = 50016884
Trg + Lig
Ki
nM
ΔG°
kcal/mole
IC50
nM
Kd
nM
EC50/IC50
nM
koff
s-1
kon
M-1s-1
pHTemp
°C
5-hydroxytryptamine receptor 1A
(Rattus norvegicus (rat))
BDBM50016884
(1-Propyl-2,3,4,4a,10,10a-hexahydro-1H-9-oxa-1-aza-...)
Show SMILES CCCN1CCC[C@H]2[C@H]1COc1c(O)cccc21
Show InChI InChI=1S/C15H21NO2/c1-2-8-16-9-4-6-11-12-5-3-7-14(17)15(12)18-10-13(11)16/h3,5,7,11,13,17H,2,4,6,8-10H2,1H3/t11-,13-/m1/s1
n/an/a 1.00E+3n/an/an/an/an/an/a
CIBA-GEIGY Corporation
Curated by ChEMBL
Assay Description
Concentration necessary to achieve half maximal inhibition of [3H]-8-Hydroxy-2-(di-n-propylamino)tetralin binding to 5-hydroxytryptamine 1A receptor ...
J Med Chem 32: 720-7 (1989)
BindingDB Entry DOI: 10.7270/Q2639NQ6
adrenergic Alpha2
(BOVINE)
BDBM50016884
(1-Propyl-2,3,4,4a,10,10a-hexahydro-1H-9-oxa-1-aza-...)
Show SMILES CCCN1CCC[C@H]2[C@H]1COc1c(O)cccc21
Show InChI InChI=1S/C15H21NO2/c1-2-8-16-9-4-6-11-12-5-3-7-14(17)15(12)18-10-13(11)16/h3,5,7,11,13,17H,2,4,6,8-10H2,1H3/t11-,13-/m1/s1
n/an/a 77n/an/an/an/an/an/a
CIBA-GEIGY Corporation
Curated by ChEMBL
Assay Description
Concentration necessary to achieve half maximal inhibition of [3H]-clonidine binding to alpha-2 adrenergic receptor at 1 uM
J Med Chem 32: 720-7 (1989)
BindingDB Entry DOI: 10.7270/Q2639NQ6
Dopamine receptor
(BOVINE)
BDBM50016884
(1-Propyl-2,3,4,4a,10,10a-hexahydro-1H-9-oxa-1-aza-...)
Show SMILES CCCN1CCC[C@H]2[C@H]1COc1c(O)cccc21
Show InChI InChI=1S/C15H21NO2/c1-2-8-16-9-4-6-11-12-5-3-7-14(17)15(12)18-10-13(11)16/h3,5,7,11,13,17H,2,4,6,8-10H2,1H3/t11-,13-/m1/s1
n/an/a 30n/an/an/an/an/an/a
CIBA-GEIGY Corporation
Curated by ChEMBL
Assay Description
Concentration necessary to achieve half maximal inhibition of [3H](+)-23amino-6,7-dihydroxy-1,2,3,4-tetrahydronaphthalene binding to dopamine recepto...
J Med Chem 32: 720-7 (1989)
BindingDB Entry DOI: 10.7270/Q2639NQ6
Dopamine receptor
(BOVINE)
BDBM50016884
(1-Propyl-2,3,4,4a,10,10a-hexahydro-1H-9-oxa-1-aza-...)
Show SMILES CCCN1CCC[C@H]2[C@H]1COc1c(O)cccc21
Show InChI InChI=1S/C15H21NO2/c1-2-8-16-9-4-6-11-12-5-3-7-14(17)15(12)18-10-13(11)16/h3,5,7,11,13,17H,2,4,6,8-10H2,1H3/t11-,13-/m1/s1
n/an/a 260n/an/an/an/an/an/a
CIBA-GEIGY Corporation
Curated by ChEMBL
Assay Description
Concentration necessary to achieve half maximal inhibition of [3H]spiperone binding dopamine receptor at 1 uM
J Med Chem 32: 720-7 (1989)
BindingDB Entry DOI: 10.7270/Q2639NQ6
Serotonin 2 (5-HT2) receptor
(Rattus norvegicus (rat)-RAT-Rattus norvegicus (Rat...)
BDBM50016884
(1-Propyl-2,3,4,4a,10,10a-hexahydro-1H-9-oxa-1-aza-...)
Show SMILES CCCN1CCC[C@H]2[C@H]1COc1c(O)cccc21
Show InChI InChI=1S/C15H21NO2/c1-2-8-16-9-4-6-11-12-5-3-7-14(17)15(12)18-10-13(11)16/h3,5,7,11,13,17H,2,4,6,8-10H2,1H3/t11-,13-/m1/s1
n/an/a 1.10E+3n/an/an/an/an/an/a
CIBA-GEIGY Corporation
Curated by ChEMBL
Assay Description
Concentration necessary to achieve half maximal inhibition of [3H]ketanserin binding to 5-hydroxytryptamine 2 receptor at 1 uM
J Med Chem 32: 720-7 (1989)
BindingDB Entry DOI: 10.7270/Q2639NQ6