BDBM50016959 4-Methyl-1-[4-(4-thieno[3,2-c]pyridin-4-yl-piperazin-1-yl)-butyl]-piperidine-2,6-dione; hydrochloride::CHEMBL537924
SMILES: CC1CC(=O)N(CCCCN2CCN(CC2)c2nccc3sccc23)C(=O)C1
InChI Key: InChIKey=LKUJZLFUMLHSCS-UHFFFAOYSA-N
Data: 4 IC50
Activity Spreadsheet -- Enzyme Inhibition Constant Data from BindingDB
Found 4 hits for monomerid = 50016959
Trg + Lig
Ki
nM
ΔG°
kcal/mole
IC50
nM
Kd
nM
EC50/IC50
nM
koff
s-1
kon
M-1s-1
pHTemp
°C
Serotonin 2 (5-HT2) receptor
(Rattus norvegicus (rat)-RAT-Rattus norvegicus (Rat...)
BDBM50016959
(4-Methyl-1-[4-(4-thieno[3,2-c]pyridin-4-yl-piperaz...)
Show SMILES CC1CC(=O)N(CCCCN2CCN(CC2)c2nccc3sccc23)C(=O)C1
Show InChI InChI=1S/C21H28N4O2S/c1-16-14-19(26)25(20(27)15-16)8-3-2-7-23-9-11-24(12-10-23)21-17-5-13-28-18(17)4-6-22-21/h4-6,13,16H,2-3,7-12,14-15H2,1H3
n/an/a 4.20n/an/an/an/an/an/a
Bristol-Myers Company
Curated by ChEMBL
Assay Description
Ability to bind at serotonin 5-hydroxytryptamine 2 receptors of rat hippocampus by displacing [3H]spiperone
J Med Chem 32: 1147-56 (1989)
BindingDB Entry DOI: 10.7270/Q2HD7W8D
5-hydroxytryptamine receptor 1A
(Rattus norvegicus (rat))
BDBM50016959
(4-Methyl-1-[4-(4-thieno[3,2-c]pyridin-4-yl-piperaz...)
Show SMILES CC1CC(=O)N(CCCCN2CCN(CC2)c2nccc3sccc23)C(=O)C1
Show InChI InChI=1S/C21H28N4O2S/c1-16-14-19(26)25(20(27)15-16)8-3-2-7-23-9-11-24(12-10-23)21-17-5-13-28-18(17)4-6-22-21/h4-6,13,16H,2-3,7-12,14-15H2,1H3
n/an/a 1.30n/an/an/an/an/an/a
Bristol-Myers Company
Curated by ChEMBL
Assay Description
Ability to bind at serotonin 5-hydroxytryptamine 1A receptors of rat hippocampus by displacing [3H]8-OH-DPAT
J Med Chem 32: 1147-56 (1989)
BindingDB Entry DOI: 10.7270/Q2HD7W8D
D(2) dopamine receptor
(Rattus norvegicus (rat))
BDBM50016959
(4-Methyl-1-[4-(4-thieno[3,2-c]pyridin-4-yl-piperaz...)
Show SMILES CC1CC(=O)N(CCCCN2CCN(CC2)c2nccc3sccc23)C(=O)C1
Show InChI InChI=1S/C21H28N4O2S/c1-16-14-19(26)25(20(27)15-16)8-3-2-7-23-9-11-24(12-10-23)21-17-5-13-28-18(17)4-6-22-21/h4-6,13,16H,2-3,7-12,14-15H2,1H3
Reactome pathway
n/an/a 663n/an/an/an/an/an/a
Bristol-Myers Company
Curated by ChEMBL
Assay Description
Ability to bind at Dopamine receptor D2 of rat corpus striatum by displacing [3H]spiperone
J Med Chem 32: 1147-56 (1989)
BindingDB Entry DOI: 10.7270/Q2HD7W8D
Serotonin 1 (5-HT1) receptor
(RAT-Rattus norvegicus (rat)-Rattus norvegicus (Rat...)
BDBM50016959
(4-Methyl-1-[4-(4-thieno[3,2-c]pyridin-4-yl-piperaz...)
Show SMILES CC1CC(=O)N(CCCCN2CCN(CC2)c2nccc3sccc23)C(=O)C1
Show InChI InChI=1S/C21H28N4O2S/c1-16-14-19(26)25(20(27)15-16)8-3-2-7-23-9-11-24(12-10-23)21-17-5-13-28-18(17)4-6-22-21/h4-6,13,16H,2-3,7-12,14-15H2,1H3
n/an/a 8.80n/an/an/an/an/an/a
Bristol-Myers Company
Curated by ChEMBL
Assay Description
Ability to bind at 5-hydroxytryptamine 1 receptor of rat hippocampus by displacing [3H]5-HT
J Med Chem 32: 1147-56 (1989)
BindingDB Entry DOI: 10.7270/Q2HD7W8D