BDBM50017087 CHEMBL3287041::US9428504, 10
SMILES: CC(C)(C)CN1CCC2(CN(c3c2c(ccc3O)C(F)(F)F)c2ccccc2NC(=O)Nc2ccc(OC(F)(F)F)cc2)CC1
InChI Key: InChIKey=YJEXLDWRVWNACW-UHFFFAOYSA-N
Data: 1 KI  1 IC50
Activity Spreadsheet -- Enzyme Inhibition Constant Data from BindingDB
Found 2 hits for monomerid = 50017087
Trg + Lig
Ki
nM
ΔG°
kcal/mole
IC50
nM
Kd
nM
EC50/IC50
nM
koff
s-1
kon
M-1s-1
pHTemp
°C
Purinergic receptor P2Y1
(Homo sapiens (Human))
BDBM50017087
(CHEMBL3287041 | US9428504, 10)
Show SMILES CC(C)(C)CN1CCC2(CN(c3c2c(ccc3O)C(F)(F)F)c2ccccc2NC(=O)Nc2ccc(OC(F)(F)F)cc2)CC1
Show InChI InChI=1S/C32H34F6N4O3/c1-29(2,3)18-41-16-14-30(15-17-41)19-42(27-25(43)13-12-22(26(27)30)31(33,34)35)24-7-5-4-6-23(24)40-28(44)39-20-8-10-21(11-9-20)45-32(36,37)38/h4-13,43H,14-19H2,1-3H3,(H2,39,40,44)
US Patent
4.5 -11.4n/an/an/an/an/a7.425
Bristol-Myers Squibb Company
US Patent
Assay Description
A SPA membrane binding assay was used to identify inhibitors of [33P] 2MeS-ADP binding to cloned human P2Y1 receptors (The P2Y1 receptor membranes we...
US Patent US9428504 (2016)
BindingDB Entry DOI: 10.7270/Q24748SD
Purinergic receptor P2Y1
(Homo sapiens (Human))
BDBM50017087
(CHEMBL3287041 | US9428504, 10)
Show SMILES CC(C)(C)CN1CCC2(CN(c3c2c(ccc3O)C(F)(F)F)c2ccccc2NC(=O)Nc2ccc(OC(F)(F)F)cc2)CC1
Show InChI InChI=1S/C32H34F6N4O3/c1-29(2,3)18-41-16-14-30(15-17-41)19-42(27-25(43)13-12-22(26(27)30)31(33,34)35)24-7-5-4-6-23(24)40-28(44)39-20-8-10-21(11-9-20)45-32(36,37)38/h4-13,43H,14-19H2,1-3H3,(H2,39,40,44)
n/an/a 0.140n/an/an/an/an/an/a
Bristol-Myers Squibb
Curated by ChEMBL
Assay Description
Antagonist activity at P2Y1 receptor in human platelets by FLIPR assay in presence of 2-methylthio-ADP
Bioorg Med Chem Lett 24: 1294-8 (2014)
Article DOI: 10.1016/j.bmcl.2014.01.066
BindingDB Entry DOI: 10.7270/Q20G3MQF