BDBM50017093 4-(3,4-Dimethoxy-phenyl)-3-methyl-pyrrolidin-2-one::CHEMBL285663
SMILES: COc1ccc(cc1OC)C1CNC(=O)C1C
InChI Key: InChIKey=XLPLZVWBDGDVJU-UHFFFAOYSA-N
Data: 3 IC50
Activity Spreadsheet -- Enzyme Inhibition Constant Data from BindingDB
Found 3 hits for monomerid = 50017093
Trg + Lig
Ki
nM
ΔG°
kcal/mole
IC50
nM
Kd
nM
EC50/IC50
nM
koff
s-1
kon
M-1s-1
pHTemp
°C
Phosphodiesterase 5A
(Bos taurus)
BDBM50017093
(4-(3,4-Dimethoxy-phenyl)-3-methyl-pyrrolidin-2-one...)
Show SMILES COc1ccc(cc1OC)C1CNC(=O)C1C
Show InChI InChI=1S/C13H17NO3/c1-8-10(7-14-13(8)15)9-4-5-11(16-2)12(6-9)17-3/h4-6,8,10H,7H2,1-3H3,(H,14,15)
Reactome pathway
n/an/a>1.00E+6n/an/an/an/an/an/a
Centre de Neurochimie du CNRS
Curated by ChEMBL
Assay Description
Inhibitory activity against phosphodiesterase was determined in vitro using bovine aorta, at 1 uM cGMP for cGMP-PDE.
J Med Chem 32: 1450-7 (1989)
BindingDB Entry DOI: 10.7270/Q2DN441H
Phosphodiesterase 4
(Homo sapiens (Human))
BDBM50017093
(4-(3,4-Dimethoxy-phenyl)-3-methyl-pyrrolidin-2-one...)
Show SMILES COc1ccc(cc1OC)C1CNC(=O)C1C
Show InChI InChI=1S/C13H17NO3/c1-8-10(7-14-13(8)15)9-4-5-11(16-2)12(6-9)17-3/h4-6,8,10H,7H2,1-3H3,(H,14,15)
n/an/a 2.20E+4n/an/an/an/an/an/a
Centre de Neurochimie du CNRS
Curated by ChEMBL
Assay Description
Inhibitory activity against phosphodiesterase was determined in vitro using bovine aorta, at 1 uM cAMP for cAMP-PDE.
J Med Chem 32: 1450-7 (1989)
BindingDB Entry DOI: 10.7270/Q2DN441H
Phosphodiesterase 1
(Bos taurus-BOVINE)
BDBM50017093
(4-(3,4-Dimethoxy-phenyl)-3-methyl-pyrrolidin-2-one...)
Show SMILES COc1ccc(cc1OC)C1CNC(=O)C1C
Show InChI InChI=1S/C13H17NO3/c1-8-10(7-14-13(8)15)9-4-5-11(16-2)12(6-9)17-3/h4-6,8,10H,7H2,1-3H3,(H,14,15)
n/an/a>1.00E+6n/an/an/an/an/an/a
Centre de Neurochimie du CNRS
Curated by ChEMBL
Assay Description
Inhibitory activity against phosphodiesterase was determined in vitro using bovine aorta, at 1 uM cGMP in the presence of calcium (10 uM) and calmodu...
J Med Chem 32: 1450-7 (1989)
BindingDB Entry DOI: 10.7270/Q2DN441H