BDBM50017096 4-(3-Benzyloxy-4-methoxy-phenyl)-pyrrolidin-2-one::CHEMBL289253
SMILES: COc1ccc(cc1OCc1ccccc1)C1CNC(=O)C1
InChI Key: InChIKey=QLIBRFKGUKUNLP-UHFFFAOYSA-N
Data: 3 IC50
Activity Spreadsheet -- Enzyme Inhibition Constant Data from BindingDB
Found 3 hits for monomerid = 50017096
Trg + Lig
Ki
nM
ΔG°
kcal/mole
IC50
nM
Kd
nM
EC50/IC50
nM
koff
s-1
kon
M-1s-1
pHTemp
°C
Phosphodiesterase 5A
(Bos taurus)
BDBM50017096
(4-(3-Benzyloxy-4-methoxy-phenyl)-pyrrolidin-2-one ...)
Show SMILES COc1ccc(cc1OCc1ccccc1)C1CNC(=O)C1
Show InChI InChI=1S/C18H19NO3/c1-21-16-8-7-14(15-10-18(20)19-11-15)9-17(16)22-12-13-5-3-2-4-6-13/h2-9,15H,10-12H2,1H3,(H,19,20)
Reactome pathway
n/an/a 1.74E+5n/an/an/an/an/an/a
Centre de Neurochimie du CNRS
Curated by ChEMBL
Assay Description
Inhibitory activity against phosphodiesterase was determined in vitro using bovine aorta, at 1 uM cGMP for cGMP-PDE.
J Med Chem 32: 1450-7 (1989)
BindingDB Entry DOI: 10.7270/Q2DN441H
Phosphodiesterase 4
(Homo sapiens (Human))
BDBM50017096
(4-(3-Benzyloxy-4-methoxy-phenyl)-pyrrolidin-2-one ...)
Show SMILES COc1ccc(cc1OCc1ccccc1)C1CNC(=O)C1
Show InChI InChI=1S/C18H19NO3/c1-21-16-8-7-14(15-10-18(20)19-11-15)9-17(16)22-12-13-5-3-2-4-6-13/h2-9,15H,10-12H2,1H3,(H,19,20)
n/an/a 9.60E+4n/an/an/an/an/an/a
Centre de Neurochimie du CNRS
Curated by ChEMBL
Assay Description
Inhibitory activity against phosphodiesterase was determined in vitro using bovine aorta, at 1 uM cAMP for cAMP-PDE.
J Med Chem 32: 1450-7 (1989)
BindingDB Entry DOI: 10.7270/Q2DN441H
Phosphodiesterase 1
(Bos taurus-BOVINE)
BDBM50017096
(4-(3-Benzyloxy-4-methoxy-phenyl)-pyrrolidin-2-one ...)
Show SMILES COc1ccc(cc1OCc1ccccc1)C1CNC(=O)C1
Show InChI InChI=1S/C18H19NO3/c1-21-16-8-7-14(15-10-18(20)19-11-15)9-17(16)22-12-13-5-3-2-4-6-13/h2-9,15H,10-12H2,1H3,(H,19,20)
n/an/a>1.00E+6n/an/an/an/an/an/a
Centre de Neurochimie du CNRS
Curated by ChEMBL
Assay Description
Inhibitory activity against phosphodiesterase was determined in vitro using bovine aorta, at 1 uM cGMP in the presence of calcium (10 uM) and calmodu...
J Med Chem 32: 1450-7 (1989)
BindingDB Entry DOI: 10.7270/Q2DN441H