BDBM50017227 CHEMBL3287675::US10099993, Compound 24
SMILES: CC(C)CC(=O)c1ccc(OCCCCOc2cccc(c2)C(O)=O)c(C)c1O
InChI Key: InChIKey=BTAUFYWICSLREV-UHFFFAOYSA-N
Data: 4 EC50
Activity Spreadsheet -- Enzyme Inhibition Constant Data from BindingDB
Found 4 hits for monomerid = 50017227
Trg + Lig
Ki
nM
ΔG°
kcal/mole
IC50
nM
Kd
nM
EC50/IC50
nM
koff
s-1
kon
M-1s-1
pHTemp
°C
Metabotropic glutamate receptor 3
(Rattus norvegicus (Rat))
BDBM50017227
(CHEMBL3287675 | US10099993, Compound 24)
Show SMILES CC(C)CC(=O)c1ccc(OCCCCOc2cccc(c2)C(O)=O)c(C)c1O
Show InChI InChI=1S/C23H28O6/c1-15(2)13-20(24)19-9-10-21(16(3)22(19)25)29-12-5-4-11-28-18-8-6-7-17(14-18)23(26)27/h6-10,14-15,25H,4-5,11-13H2,1-3H3,(H,26,27)
n/an/an/an/a 1.43E+3n/an/an/an/a
Sanford-Burnham Medical Research Institute
Curated by ChEMBL
Assay Description
Positive allosteric modulation of rat mGluR3 receptor expressed in HEK293 cells assessed as potentiation of glutamate-induced thallium flux incubated...
J Med Chem 57: 4154-72 (2014)
Article DOI: 10.1021/jm5000563
BindingDB Entry DOI: 10.7270/Q2GH9KH9
Metabotropic glutamate receptor 3
(Homo sapiens (Human))
BDBM50017227
(CHEMBL3287675 | US10099993, Compound 24)
Show SMILES CC(C)CC(=O)c1ccc(OCCCCOc2cccc(c2)C(O)=O)c(C)c1O
Show InChI InChI=1S/C23H28O6/c1-15(2)13-20(24)19-9-10-21(16(3)22(19)25)29-12-5-4-11-28-18-8-6-7-17(14-18)23(26)27/h6-10,14-15,25H,4-5,11-13H2,1-3H3,(H,26,27)
US Patent
n/an/an/an/a 1.43E+3n/an/an/an/a
SANFORD-BURNHAM MEDICAL RESEARCH INSTITUTE
US Patent
US Patent US10099993 (2018)
BindingDB Entry DOI: 10.7270/Q2Z89FFP
Metabotropic glutamate receptor 2
(Homo sapiens (Human))
BDBM50017227
(CHEMBL3287675 | US10099993, Compound 24)
Show SMILES CC(C)CC(=O)c1ccc(OCCCCOc2cccc(c2)C(O)=O)c(C)c1O
Show InChI InChI=1S/C23H28O6/c1-15(2)13-20(24)19-9-10-21(16(3)22(19)25)29-12-5-4-11-28-18-8-6-7-17(14-18)23(26)27/h6-10,14-15,25H,4-5,11-13H2,1-3H3,(H,26,27)
US Patent
n/an/an/an/a 222n/an/a7.325
SANFORD-BURNHAM MEDICAL RESEARCH INSTITUTE
US Patent
Assay Description
Human Embryonic Kidney (HEK-293) cell lines co-expressing rat mGlu receptors 2, 3, 4, 6, 7 or 8 and G protein-coupled inwardly-rectifying potassium (...
US Patent US10099993 (2018)
BindingDB Entry DOI: 10.7270/Q2Z89FFP
Metabotropic glutamate receptor 2
(Homo sapiens (Human))
BDBM50017227
(CHEMBL3287675 | US10099993, Compound 24)
Show SMILES CC(C)CC(=O)c1ccc(OCCCCOc2cccc(c2)C(O)=O)c(C)c1O
Show InChI InChI=1S/C23H28O6/c1-15(2)13-20(24)19-9-10-21(16(3)22(19)25)29-12-5-4-11-28-18-8-6-7-17(14-18)23(26)27/h6-10,14-15,25H,4-5,11-13H2,1-3H3,(H,26,27)
n/an/an/an/a 222n/an/an/an/a
Sanford-Burnham Medical Research Institute
Curated by ChEMBL
Assay Description
Positive allosteric modulation of rat mGluR2 receptor expressed in HEK293 cells assessed as potentiation of glutamate-induced thallium flux incubated...
J Med Chem 57: 4154-72 (2014)
Article DOI: 10.1021/jm5000563
BindingDB Entry DOI: 10.7270/Q2GH9KH9