BDBM50017248 CHEMBL3287689::US10099993, Compound 38
SMILES: CC(C)CC(=O)c1ccc(OCCCCOc2cc(ccc2C)C(O)=O)c(C)c1O
InChI Key: InChIKey=IXQOSACEYQVKSU-UHFFFAOYSA-N
Data: 4 EC50
Activity Spreadsheet -- Enzyme Inhibition Constant Data from BindingDB
Found 4 hits for monomerid = 50017248
Trg + Lig
Ki
nM
ΔG°
kcal/mole
IC50
nM
Kd
nM
EC50/IC50
nM
koff
s-1
kon
M-1s-1
pHTemp
°C
Metabotropic glutamate receptor 3
(Rattus norvegicus (Rat))
BDBM50017248
(CHEMBL3287689 | US10099993, Compound 38)
Show SMILES CC(C)CC(=O)c1ccc(OCCCCOc2cc(ccc2C)C(O)=O)c(C)c1O
Show InChI InChI=1S/C24H30O6/c1-15(2)13-20(25)19-9-10-21(17(4)23(19)26)29-11-5-6-12-30-22-14-18(24(27)28)8-7-16(22)3/h7-10,14-15,26H,5-6,11-13H2,1-4H3,(H,27,28)
n/an/an/an/a>1.00E+4n/an/an/an/a
Sanford-Burnham Medical Research Institute
Curated by ChEMBL
Assay Description
Positive allosteric modulation of rat mGluR3 receptor expressed in HEK293 cells assessed as potentiation of glutamate-induced thallium flux incubated...
J Med Chem 57: 4154-72 (2014)
Article DOI: 10.1021/jm5000563
BindingDB Entry DOI: 10.7270/Q2GH9KH9
Metabotropic glutamate receptor 3
(Homo sapiens (Human))
BDBM50017248
(CHEMBL3287689 | US10099993, Compound 38)
Show SMILES CC(C)CC(=O)c1ccc(OCCCCOc2cc(ccc2C)C(O)=O)c(C)c1O
Show InChI InChI=1S/C24H30O6/c1-15(2)13-20(25)19-9-10-21(17(4)23(19)26)29-11-5-6-12-30-22-14-18(24(27)28)8-7-16(22)3/h7-10,14-15,26H,5-6,11-13H2,1-4H3,(H,27,28)
US Patent
n/an/an/an/a>1.00E+4n/an/an/an/a
SANFORD-BURNHAM MEDICAL RESEARCH INSTITUTE
US Patent
US Patent US10099993 (2018)
BindingDB Entry DOI: 10.7270/Q2Z89FFP
Metabotropic glutamate receptor 2
(Homo sapiens (Human))
BDBM50017248
(CHEMBL3287689 | US10099993, Compound 38)
Show SMILES CC(C)CC(=O)c1ccc(OCCCCOc2cc(ccc2C)C(O)=O)c(C)c1O
Show InChI InChI=1S/C24H30O6/c1-15(2)13-20(25)19-9-10-21(17(4)23(19)26)29-11-5-6-12-30-22-14-18(24(27)28)8-7-16(22)3/h7-10,14-15,26H,5-6,11-13H2,1-4H3,(H,27,28)
US Patent
n/an/an/an/a 454n/an/a7.325
SANFORD-BURNHAM MEDICAL RESEARCH INSTITUTE
US Patent
Assay Description
Human Embryonic Kidney (HEK-293) cell lines co-expressing rat mGlu receptors 2, 3, 4, 6, 7 or 8 and G protein-coupled inwardly-rectifying potassium (...
US Patent US10099993 (2018)
BindingDB Entry DOI: 10.7270/Q2Z89FFP
Metabotropic glutamate receptor 2
(Homo sapiens (Human))
BDBM50017248
(CHEMBL3287689 | US10099993, Compound 38)
Show SMILES CC(C)CC(=O)c1ccc(OCCCCOc2cc(ccc2C)C(O)=O)c(C)c1O
Show InChI InChI=1S/C24H30O6/c1-15(2)13-20(25)19-9-10-21(17(4)23(19)26)29-11-5-6-12-30-22-14-18(24(27)28)8-7-16(22)3/h7-10,14-15,26H,5-6,11-13H2,1-4H3,(H,27,28)
n/an/an/an/a 454n/an/an/an/a
Sanford-Burnham Medical Research Institute
Curated by ChEMBL
Assay Description
Positive allosteric modulation of rat mGluR2 receptor expressed in HEK293 cells assessed as potentiation of glutamate-induced thallium flux incubated...
J Med Chem 57: 4154-72 (2014)
Article DOI: 10.1021/jm5000563
BindingDB Entry DOI: 10.7270/Q2GH9KH9