BDBM50017273 CHEMBL371464
SMILES: CC(C)CC(=O)c1ccc(OCCCCOc2ccc3ccc(=O)oc3c2)c(C)c1O
InChI Key: InChIKey=NBPPGKVCXHKGCL-UHFFFAOYSA-N
Data: 1 EC50
Activity Spreadsheet -- Enzyme Inhibition Constant Data from BindingDB
Found 1 hit for monomerid = 50017273
Trg + Lig
Ki
nM
ΔG°
kcal/mole
IC50
nM
Kd
nM
EC50/IC50
nM
koff
s-1
kon
M-1s-1
pHTemp
°C
Metabotropic glutamate receptor 2
(Homo sapiens (Human))
BDBM50017273
(CHEMBL371464)
Show SMILES CC(C)CC(=O)c1ccc(OCCCCOc2ccc3ccc(=O)oc3c2)c(C)c1O
Show InChI InChI=1S/C25H28O6/c1-16(2)14-21(26)20-9-10-22(17(3)25(20)28)30-13-5-4-12-29-19-8-6-18-7-11-24(27)31-23(18)15-19/h6-11,15-16,28H,4-5,12-14H2,1-3H3
n/an/an/an/a>1.00E+4n/an/an/an/a
Sanford-Burnham Medical Research Institute
Curated by ChEMBL
Assay Description
Positive allosteric modulation of rat mGluR2 receptor expressed in HEK293 cells assessed as potentiation of glutamate-induced thallium flux incubated...
J Med Chem 57: 4154-72 (2014)
Article DOI: 10.1021/jm5000563
BindingDB Entry DOI: 10.7270/Q2GH9KH9