BDBM50017725 (S)-4-Isobutylamino-7,7-dioxo-4,5,6,7-tetrahydro-7lambda*6*-thieno[2,3-b]thiopyran-2-sulfonic acid amide::4-Isobutylamino-7,7-dioxo-4,5,6,7-tetrahydro-7lambda*6*-thieno[2,3-b]thiopyran-2-sulfonic acid amide::4-Isobutylamino-7,7-dioxo-4,5,6,7-tetrahydro-7lambda*6*-thieno[2,3-b]thiopyran-2-sulfonic acid amide; hydrochloride::CHEMBL545013::MK-417::MK-927
SMILES: CC(C)CNC1CCS(=O)(=O)c2sc(cc12)S(N)(=O)=O
InChI Key: InChIKey=JFLUCCKXAYBETQ-UHFFFAOYSA-N
Data: 1 KI  1 IC50
Activity Spreadsheet -- Enzyme Inhibition Constant Data from BindingDB
Found 2 hits for monomerid = 50017725
Trg + Lig
Ki
nM
ΔG°
kcal/mole
IC50
nM
Kd
nM
EC50/IC50
nM
koff
s-1
kon
M-1s-1
pHTemp
°C
Carbonic anhydrase 2
(Homo sapiens (Human))
BDBM50017725
((S)-4-Isobutylamino-7,7-dioxo-4,5,6,7-tetrahydro-7...)
Show SMILES CC(C)CNC1CCS(=O)(=O)c2sc(cc12)S(N)(=O)=O
Show InChI InChI=1S/C11H18N2O4S3/c1-7(2)6-13-9-3-4-19(14,15)11-8(9)5-10(18-11)20(12,16)17/h5,7,9,13H,3-4,6H2,1-2H3,(H2,12,16,17)
Reactome pathway
0.600n/an/an/an/an/an/an/an/a
Merck Research Laboratories
Curated by ChEMBL
Assay Description
Tested for ability to compete with dansylamide for binding to human erythrocyte carbonic-anhydrase-II (HCA-II)
J Med Chem 37: 240-7 (1994)
BindingDB Entry DOI: 10.7270/Q2N29XKD
Carbonic anhydrase 2
(Homo sapiens (Human))
BDBM50017725
((S)-4-Isobutylamino-7,7-dioxo-4,5,6,7-tetrahydro-7...)
Show SMILES CC(C)CNC1CCS(=O)(=O)c2sc(cc12)S(N)(=O)=O
Show InChI InChI=1S/C11H18N2O4S3/c1-7(2)6-13-9-3-4-19(14,15)11-8(9)5-10(18-11)20(12,16)17/h5,7,9,13H,3-4,6H2,1-2H3,(H2,12,16,17)
Reactome pathway
n/an/a 1.20n/an/an/an/an/an/a
Merck Research Laboratories
Curated by ChEMBL
Assay Description
Tested for ability to inhibit human erythrocyte carbonic-anhydrase-II- (HCA II) catalyzed carbon dioxide hydration
J Med Chem 37: 240-7 (1994)
BindingDB Entry DOI: 10.7270/Q2N29XKD