BDBM50018256 CHEMBL3290284
SMILES: COc1ccc(cc1)C1=C(CCCc2cc(O)ccc12)c1ccccc1
InChI Key: InChIKey=JVAQWKFBYWPNEL-UHFFFAOYSA-N
Data: 1 EC50
Activity Spreadsheet -- Enzyme Inhibition Constant Data from BindingDB
Found 1 hit for monomerid = 50018256
Trg + Lig
Ki
nM
ΔG°
kcal/mole
IC50
nM
Kd
nM
EC50/IC50
nM
koff
s-1
kon
M-1s-1
pHTemp
°C
Estrogen receptor
(Homo sapiens (Human))
BDBM50018256
(CHEMBL3290284)
Show SMILES COc1ccc(cc1)C1=C(CCCc2cc(O)ccc12)c1ccccc1 |t:9|
Show InChI InChI=1S/C24H22O2/c1-26-21-13-10-18(11-14-21)24-22(17-6-3-2-4-7-17)9-5-8-19-16-20(25)12-15-23(19)24/h2-4,6-7,10-16,25H,5,8-9H2,1H3
n/an/an/an/a 0.300n/an/an/an/a
Georgetown University
Curated by ChEMBL
Assay Description
Agonist activity at ER in human MCF7:WS8 cells assessed as increase in cell growth by measuring DNA level after 7 days by fluorescence analysis
J Med Chem 57: 4569-83 (2014)
Article DOI: 10.1021/jm500569h
BindingDB Entry DOI: 10.7270/Q2H996R4