BDBM50018257 CHEMBL3290282
SMILES: CCOc1ccc(cc1)C1=C(CCCc2cc(O)ccc12)c1ccccc1
InChI Key: InChIKey=KJTZITGZMHOKOP-UHFFFAOYSA-N
Data: 1 EC50
Activity Spreadsheet -- Enzyme Inhibition Constant Data from BindingDB
Found 1 hit for monomerid = 50018257
Trg + Lig
Ki
nM
ΔG°
kcal/mole
IC50
nM
Kd
nM
EC50/IC50
nM
koff
s-1
kon
M-1s-1
pHTemp
°C
Estrogen receptor
(Homo sapiens (Human))
BDBM50018257
(CHEMBL3290282)
Show SMILES CCOc1ccc(cc1)C1=C(CCCc2cc(O)ccc12)c1ccccc1 |t:10|
Show InChI InChI=1S/C25H24O2/c1-2-27-22-14-11-19(12-15-22)25-23(18-7-4-3-5-8-18)10-6-9-20-17-21(26)13-16-24(20)25/h3-5,7-8,11-17,26H,2,6,9-10H2,1H3
n/an/an/an/a 0.300n/an/an/an/a
Georgetown University
Curated by ChEMBL
Assay Description
Agonist activity at ER in human MCF7:WS8 cells assessed as increase in cell growth by measuring DNA level after 7 days by fluorescence analysis
J Med Chem 57: 4569-83 (2014)
Article DOI: 10.1021/jm500569h
BindingDB Entry DOI: 10.7270/Q2H996R4