null
SMILES: COc1ccc(cc1OC)-c1ccc(cc1[N+]([O-])=O)C(=O)N[C@H](C)CCCc1cccnc1
InChI Key: InChIKey=WXDCROCQFUXYJG-QGZVFWFLSA-N
Activity Spreadsheet -- Enzyme Inhibition Constant Data from BindingDB
Found 1 hit for monomerid = 50018331
Trg + Lig
Ki
nM
ΔG°
kcal/mole
IC50
nM
Kd
nM
EC50/IC50
nM
koff
s-1
kon
M-1s-1
pHTemp
°C
Platelet-activating factor receptor
(Homo sapiens (Human))
BDBM50018331
(3',4'-Dimethoxy-2-nitro-biphenyl-4-carboxylic acid...)
Show SMILES COc1ccc(cc1OC)-c1ccc(cc1[N+]([O-])=O)C(=O)N[C@H](C)CCCc1cccnc1
Show InChI InChI=1S/C25H27N3O5/c1-17(6-4-7-18-8-5-13-26-16-18)27-25(29)20-9-11-21(22(14-20)28(30)31)19-10-12-23(32-2)24(15-19)33-3/h5,8-17H,4,6-7H2,1-3H3,(H,27,29)/t17-/m1/s1
Reactome pathway
n/an/a 200n/an/an/an/an/an/a
Roche Research Center
Curated by ChEMBL
Assay Description
Inhibition of platelet activating factor receptor binding activity in dog platelets using [3H]-PAF as radioligand.
J Med Chem 32: 1814-20 (1989)
BindingDB Entry DOI: 10.7270/Q2SQ8ZCJ