null
SMILES: [#6]-c1ccc(cc1)-[#6](=[#6]/[#6]=[#6]/[#6](=O)-[#7]-[#6]-[#6]-[#6]-[#6]-c1cccnc1)\c1ccc(-[#6])cc1
InChI Key: InChIKey=XXROTZOKAQSJRO-BJMVGYQFSA-N
Activity Spreadsheet -- Enzyme Inhibition Constant Data from BindingDB
Found 1 hit for monomerid = 50018362
Trg + Lig
Ki
nM
ΔG°
kcal/mole
IC50
nM
Kd
nM
EC50/IC50
nM
koff
s-1
kon
M-1s-1
pHTemp
°C
Platelet-activating factor receptor
(Homo sapiens (Human))
BDBM50018362
(5,5-Di-p-tolyl-penta-2,4-dienoic acid (4-pyridin-3...)
Show SMILES [#6]-c1ccc(cc1)-[#6](=[#6]/[#6]=[#6]/[#6](=O)-[#7]-[#6]-[#6]-[#6]-[#6]-c1cccnc1)\c1ccc(-[#6])cc1
Show InChI InChI=1S/C28H30N2O/c1-22-11-15-25(16-12-22)27(26-17-13-23(2)14-18-26)9-5-10-28(31)30-20-4-3-7-24-8-6-19-29-21-24/h5-6,8-19,21H,3-4,7,20H2,1-2H3,(H,30,31)/b10-5+
Reactome pathway
n/an/a 60n/an/an/an/an/an/a
Roche Research Center
Curated by ChEMBL
Assay Description
Inhibition of platelet activating factor receptor binding activity in dog platelets using [3H]-PAF as radioligand
J Med Chem 32: 1820-35 (1989)
BindingDB Entry DOI: 10.7270/Q2NZ86MR