null
SMILES: [#6]-[#8]-c1ccc(cc1)-[#6](=[#6]/[#6]=[#6]/[#6](=O)-[#7]-[#6]-[#6]-[#6]-[#6]-c1cccnc1)\c1ccc(-[#8]-[#6])cc1
InChI Key: InChIKey=DHEQLSFAAHXFEP-BJMVGYQFSA-N
Activity Spreadsheet -- Enzyme Inhibition Constant Data from BindingDB
Found 1 hit for monomerid = 50018380
Trg + Lig
Ki
nM
ΔG°
kcal/mole
IC50
nM
Kd
nM
EC50/IC50
nM
koff
s-1
kon
M-1s-1
pHTemp
°C
Platelet-activating factor receptor
(Homo sapiens (Human))
BDBM50018380
(5,5-Bis-(4-methoxy-phenyl)-penta-2,4-dienoic acid ...)
Show SMILES [#6]-[#8]-c1ccc(cc1)-[#6](=[#6]/[#6]=[#6]/[#6](=O)-[#7]-[#6]-[#6]-[#6]-[#6]-c1cccnc1)\c1ccc(-[#8]-[#6])cc1
Show InChI InChI=1S/C28H30N2O3/c1-32-25-15-11-23(12-16-25)27(24-13-17-26(33-2)18-14-24)9-5-10-28(31)30-20-4-3-7-22-8-6-19-29-21-22/h5-6,8-19,21H,3-4,7,20H2,1-2H3,(H,30,31)/b10-5+
Reactome pathway
n/an/a 25n/an/an/an/an/an/a
Roche Research Center
Curated by ChEMBL
Assay Description
Inhibition of platelet activating factor receptor binding activity in dog platelets using [3H]-PAF as radioligand
J Med Chem 32: 1820-35 (1989)
BindingDB Entry DOI: 10.7270/Q2NZ86MR