BDBM50018436 2,6-Diamino-hexanoic acid (2-{2-[4-(2,6-dioxo-1,3-dipropyl-2,3,6,7-tetrahydro-1H-purin-8-yl)-phenoxy]-acetylamino}-ethyl)-amide; dihydrobromide::CHEMBL553037
SMILES: CCCn1c2nc([nH]c2c(=O)n(CCC)c1=O)-c1ccc(OCC(=O)NCCNC(=O)C(N)CCCCN)cc1
InChI Key: InChIKey=AFUKOGGTPWMWJR-UHFFFAOYSA-N
Data: 2 KI
Activity Spreadsheet -- Enzyme Inhibition Constant Data from BindingDB
Found 2 hits for monomerid = 50018436
Trg + Lig
Ki
nM
ΔG°
kcal/mole
IC50
nM
Kd
nM
EC50/IC50
nM
koff
s-1
kon
M-1s-1
pHTemp
°C
Adenosine receptor A1
(Rattus norvegicus (rat))
BDBM50018436
(2,6-Diamino-hexanoic acid (2-{2-[4-(2,6-dioxo-1,3-...)
Show SMILES CCCn1c2nc([nH]c2c(=O)n(CCC)c1=O)-c1ccc(OCC(=O)NCCNC(=O)C(N)CCCCN)cc1
Show InChI InChI=1S/C27H40N8O5/c1-3-15-34-24-22(26(38)35(16-4-2)27(34)39)32-23(33-24)18-8-10-19(11-9-18)40-17-21(36)30-13-14-31-25(37)20(29)7-5-6-12-28/h8-11,20H,3-7,12-17,28-29H2,1-2H3,(H,30,36)(H,31,37)(H,32,33)
Reactome pathway
0.870n/an/an/an/an/an/an/an/a
NIDDK
Curated by ChEMBL
Assay Description
Inhibition of binding of 1 nM [3H]N-6-(phenylisopropyl)adenosine to adenosine A1 receptor in rat cortical membranes
J Med Chem 32: 1873-9 (1989)
BindingDB Entry DOI: 10.7270/Q2708213
Adenosine A2 receptor
(Rattus norvegicus-Rattus norvegicus (rat))
BDBM50018436
(2,6-Diamino-hexanoic acid (2-{2-[4-(2,6-dioxo-1,3-...)
Show SMILES CCCn1c2nc([nH]c2c(=O)n(CCC)c1=O)-c1ccc(OCC(=O)NCCNC(=O)C(N)CCCCN)cc1
Show InChI InChI=1S/C27H40N8O5/c1-3-15-34-24-22(26(38)35(16-4-2)27(34)39)32-23(33-24)18-8-10-19(11-9-18)40-17-21(36)30-13-14-31-25(37)20(29)7-5-6-12-28/h8-11,20H,3-7,12-17,28-29H2,1-2H3,(H,30,36)(H,31,37)(H,32,33)
180n/an/an/an/an/an/an/an/a
NIDDK
Curated by ChEMBL
Assay Description
Inhibition of binding of [3H]5'-(N-ethylcarbamoyl)-adenosine to adenosine A2 receptor in rat striatal membranes
J Med Chem 32: 1873-9 (1989)
BindingDB Entry DOI: 10.7270/Q2708213