BDBM50018445 1-((2R,5S)-5-(hydroxymethyl)-tetrahydrofuran-2-yl)-5-methylpyrimidine-2,4(1H,3H)-dione::1-((2R,5S)-5-(hydroxymethyl)tetrahydrofuran-2-yl)-5-methylpyrimidine-2,4(1H,3H)-dione::1-(5-Hydroxymethyl-tetrahydro-furan-2-yl)-5-methyl-1H-pyrimidine-2,4-dione::CHEMBL444314::cid_5280
SMILES: Cc1cn([C@H]2CC[C@@H](CO)O2)c(=O)[nH]c1=O
InChI Key: InChIKey=XKKCQTLDIPIRQD-JGVFFNPUSA-N
Data: 2 KI  3 IC50
PDB links: 1 PDB ID matches this monomer.
Activity Spreadsheet -- Enzyme Inhibition Constant Data from BindingDB
Found 5 hits for monomerid = 50018445
Trg + Lig
Ki
nM
ΔG°
kcal/mole
IC50
nM
Kd
nM
EC50/IC50
nM
koff
s-1
kon
M-1s-1
pHTemp
°C
Thymidine kinase
(Rattus norvegicus)
BDBM50018445
(1-((2R,5S)-5-(hydroxymethyl)-tetrahydrofuran-2-yl)...)
Show SMILES Cc1cn([C@H]2CC[C@@H](CO)O2)c(=O)[nH]c1=O |r|
Show InChI InChI=1S/C10H14N2O4/c1-6-4-12(10(15)11-9(6)14)8-3-2-7(5-13)16-8/h4,7-8,13H,2-3,5H2,1H3,(H,11,14,15)/t7-,8+/m0/s1
Reactome pathway
4.00E+5n/an/an/an/an/an/an/an/a
TBA
Curated by ChEMBL
Assay Description
Competitive inhibition against rat cytoplasmic Thymidine kinase
J Med Chem 25: 644-9 (1982)
BindingDB Entry DOI: 10.7270/Q2GQ6ZBJ
Thymidine kinase 2
(Rattus norvegicus)
BDBM50018445
(1-((2R,5S)-5-(hydroxymethyl)-tetrahydrofuran-2-yl)...)
Show SMILES Cc1cn([C@H]2CC[C@@H](CO)O2)c(=O)[nH]c1=O |r|
Show InChI InChI=1S/C10H14N2O4/c1-6-4-12(10(15)11-9(6)14)8-3-2-7(5-13)16-8/h4,7-8,13H,2-3,5H2,1H3,(H,11,14,15)/t7-,8+/m0/s1
Reactome pathway
8.80E+5n/an/an/an/an/an/an/an/a
TBA
Curated by ChEMBL
Assay Description
Competitive inhibition against rat mitochondrial thymidine kinase
J Med Chem 25: 644-9 (1982)
BindingDB Entry DOI: 10.7270/Q2GQ6ZBJ
Reverse transcriptase
(Human immunodeficiency virus 1)
BDBM50018445
(1-((2R,5S)-5-(hydroxymethyl)-tetrahydrofuran-2-yl)...)
Show SMILES Cc1cn([C@H]2CC[C@@H](CO)O2)c(=O)[nH]c1=O |r|
Show InChI InChI=1S/C10H14N2O4/c1-6-4-12(10(15)11-9(6)14)8-3-2-7(5-13)16-8/h4,7-8,13H,2-3,5H2,1H3,(H,11,14,15)/t7-,8+/m0/s1
n/an/a 120n/an/an/an/an/an/a
Gilead Sciences, Inc.
Curated by ChEMBL
Assay Description
Inhibition of HIV1 reverse transcriptase
Bioorg Med Chem 15: 5519-28 (2007)
Article DOI: 10.1016/j.bmc.2007.05.047
BindingDB Entry DOI: 10.7270/Q20P12S1
Human immunodeficiency virus type 1 reverse transcriptase
(Human immunodeficiency virus 1)
BDBM50018445
(1-((2R,5S)-5-(hydroxymethyl)-tetrahydrofuran-2-yl)...)
Show SMILES Cc1cn([C@H]2CC[C@@H](CO)O2)c(=O)[nH]c1=O |r|
Show InChI InChI=1S/C10H14N2O4/c1-6-4-12(10(15)11-9(6)14)8-3-2-7(5-13)16-8/h4,7-8,13H,2-3,5H2,1H3,(H,11,14,15)/t7-,8+/m0/s1
n/an/a<50n/an/an/an/an/an/a
Purdue University
Curated by ChEMBL
Assay Description
Inhibition of Shh signaling in mouse Shh-light2 cells by Gli-dependent firefly luciferase reporter gene assay
J Med Chem 35: 3369-72 (1992)
BindingDB Entry DOI: 10.7270/Q2N58N04
exonuclease V (RecBCD complex), alpha chain
(Escherichia coli str. K-12 substr. MG1655)
BDBM50018445
(1-((2R,5S)-5-(hydroxymethyl)-tetrahydrofuran-2-yl)...)
Show SMILES Cc1cn([C@H]2CC[C@@H](CO)O2)c(=O)[nH]c1=O |r|
Show InChI InChI=1S/C10H14N2O4/c1-6-4-12(10(15)11-9(6)14)8-3-2-7(5-13)16-8/h4,7-8,13H,2-3,5H2,1H3,(H,11,14,15)/t7-,8+/m0/s1
PCBioAssay
n/an/a 6.05E+4n/an/an/an/an/an/a
The Scripps Research Institute Molecular Screening Center
Curated by PubChem BioAssay
PubChem Bioassay (2013)
BindingDB Entry DOI: 10.7270/Q21G0JXG