BDBM50019407 CHEMBL3290091
SMILES: COc1ccc(-c2cc(nn2-c2ccnc3cc(Cl)ccc23)C(=O)N[C@@H](C2CCCCC2)C(O)=O)c(OC)c1
InChI Key: InChIKey=HFQAFXRLXRULMH-MHZLTWQESA-N
Data: 1 KI  1 EC50
Activity Spreadsheet -- Enzyme Inhibition Constant Data from BindingDB
Found 2 hits for monomerid = 50019407
Trg + Lig
Ki
nM
ΔG°
kcal/mole
IC50
nM
Kd
nM
EC50/IC50
nM
koff
s-1
kon
M-1s-1
pHTemp
°C
Neurotensin receptor 2
(Rattus norvegicus)
BDBM50019407
(CHEMBL3290091)
Show SMILES COc1ccc(-c2cc(nn2-c2ccnc3cc(Cl)ccc23)C(=O)N[C@@H](C2CCCCC2)C(O)=O)c(OC)c1 |r|
Show InChI InChI=1S/C29H29ClN4O5/c1-38-19-9-11-21(26(15-19)39-2)25-16-23(28(35)32-27(29(36)37)17-6-4-3-5-7-17)33-34(25)24-12-13-31-22-14-18(30)8-10-20(22)24/h8-17,27H,3-7H2,1-2H3,(H,32,35)(H,36,37)/t27-/m0/s1
1.59E+3n/an/an/an/an/an/an/an/a
Research Triangle Institute
Curated by ChEMBL
Assay Description
Displacement of [125I]NT at rat NTS2 overexpressed in CHOK1 cells after 30 mins by gamma counting
J Med Chem 57: 5318-32 (2014)
Article DOI: 10.1021/jm5003843
BindingDB Entry DOI: 10.7270/Q2PR7XJD
Neurotensin receptor 2
(Rattus norvegicus)
BDBM50019407
(CHEMBL3290091)
Show SMILES COc1ccc(-c2cc(nn2-c2ccnc3cc(Cl)ccc23)C(=O)N[C@@H](C2CCCCC2)C(O)=O)c(OC)c1 |r|
Show InChI InChI=1S/C29H29ClN4O5/c1-38-19-9-11-21(26(15-19)39-2)25-16-23(28(35)32-27(29(36)37)17-6-4-3-5-7-17)33-34(25)24-12-13-31-22-14-18(30)8-10-20(22)24/h8-17,27H,3-7H2,1-2H3,(H,32,35)(H,36,37)/t27-/m0/s1
n/an/an/an/a 382n/an/an/an/a
Research Triangle Institute
Curated by ChEMBL
Assay Description
Agonist activity at rat NTS2 stably expressed in CHOK1 cells assessed as induction of calcium release by FLIPR assay
J Med Chem 57: 5318-32 (2014)
Article DOI: 10.1021/jm5003843
BindingDB Entry DOI: 10.7270/Q2PR7XJD