null
SMILES: CC(C)c1c(C(=O)Nc2ccccc2)c(c(-c2ccc(F)cc2)n1CC[C@@H](O)C[C@@H](O)CC(=O)N1CCOCC1)-c1ccccc1
InChI Key: InChIKey=IIMXXBFYLHBYFY-FIRIVFDPSA-N
Activity Spreadsheet -- Enzyme Inhibition Constant Data from BindingDB
Found 1 hit for monomerid = 50019859
Trg + Lig
Ki
nM
ΔG°
kcal/mole
IC50
nM
Kd
nM
EC50/IC50
nM
koff
s-1
kon
M-1s-1
pHTemp
°C
Retinal rod rhodopsin-sensitive cGMP 3',5'-cyclic phosphodiesterase subunit delta
(Homo sapiens (Human))
BDBM50019859
(CHEMBL3286923)
Show SMILES CC(C)c1c(C(=O)Nc2ccccc2)c(c(-c2ccc(F)cc2)n1CC[C@@H](O)C[C@@H](O)CC(=O)N1CCOCC1)-c1ccccc1 |r|
Show InChI InChI=1S/C37H42FN3O5/c1-25(2)35-34(37(45)39-29-11-7-4-8-12-29)33(26-9-5-3-6-10-26)36(27-13-15-28(38)16-14-27)41(35)18-17-30(42)23-31(43)24-32(44)40-19-21-46-22-20-40/h3-16,25,30-31,42-43H,17-24H2,1-2H3,(H,39,45)/t30-,31-/m1/s1
n/an/an/a 16n/an/an/an/an/a
Max Planck Institute of Molecular Physiology
Curated by ChEMBL
Assay Description
Binding affinity to His6-tagged PDE-delta (unknown origin) measured every 3 mins by fluorescence polarization assay
J Med Chem 57: 5435-48 (2014)
Article DOI: 10.1021/jm500632s
BindingDB Entry DOI: 10.7270/Q24Q7WJP