null
SMILES: COc1ccc(NC(=N)c2ccncc2)cc1CSC1CCCC1
InChI Key: InChIKey=HNJFTSSAXBPOND-UHFFFAOYSA-N
Activity Spreadsheet -- Enzyme Inhibition Constant Data from BindingDB
Found 1 hit for monomerid = 50020019
Trg + Lig
Ki
nM
ΔG°
kcal/mole
IC50
nM
Kd
nM
EC50/IC50
nM
koff
s-1
kon
M-1s-1
pHTemp
°C
Pyroglutamylated RF-amide peptide receptor
(Homo sapiens (Human))
BDBM50020019
(CHEMBL3287818)
Show SMILES COc1ccc(NC(=N)c2ccncc2)cc1CSC1CCCC1
Show InChI InChI=1S/C19H23N3OS/c1-23-18-7-6-16(22-19(20)14-8-10-21-11-9-14)12-15(18)13-24-17-4-2-3-5-17/h6-12,17H,2-5,13H2,1H3,(H2,20,22)
n/an/a 1.59E+3n/an/an/an/an/an/a
AstraZeneca
Curated by ChEMBL
Assay Description
Antagonist activity at human GPR103 receptor assessed as inhibition of inositol-1-phosphate production by cell-based assay
ACS Med Chem Lett 5: 527-32 (2014)
Article DOI: 10.1021/ml400519h
BindingDB Entry DOI: 10.7270/Q2V989NR