BDBM50020194 CHEMBL3288504::US9914707, I-7
SMILES: Cc1cccc(NC(=O)c2cccc3cc(ccc23)-c2cccc3[nH]nc(N)c23)c1
InChI Key: InChIKey=OOJAUWGTLQWVOW-UHFFFAOYSA-N
Data: 3 IC50
Activity Spreadsheet -- Enzyme Inhibition Constant Data from BindingDB
Found 3 hits for monomerid = 50020194
Trg + Lig
Ki
nM
ΔG°
kcal/mole
IC50
nM
Kd
nM
EC50/IC50
nM
koff
s-1
kon
M-1s-1
pHTemp
°C
Vascular endothelial growth factor receptor 2
(Homo sapiens (Human))
BDBM50020194
(CHEMBL3288504 | US9914707, I-7)
Show SMILES Cc1cccc(NC(=O)c2cccc3cc(ccc23)-c2cccc3[nH]nc(N)c23)c1
Show InChI InChI=1S/C25H20N4O/c1-15-5-2-7-18(13-15)27-25(30)21-9-3-6-16-14-17(11-12-19(16)21)20-8-4-10-22-23(20)24(26)29-28-22/h2-14H,1H3,(H,27,30)(H3,26,28,29)
NCI pathway
Reactome pathway
n/an/a 2.10n/an/an/an/an/an/a
Chinese Academy of Sciences
Curated by ChEMBL
Assay Description
Inhibition of VEGFR-2 in HUVEC assessed as inhibition of VEGF (1 to 165)-induced cell proliferation preincubated for 2 hrs followed by VEGF (1 to 165...
ACS Med Chem Lett 5: 592-7 (2014)
Article DOI: 10.1021/ml5000417
BindingDB Entry DOI: 10.7270/Q2TB18GG
Vascular endothelial growth factor receptor 2
(Homo sapiens (Human))
BDBM50020194
(CHEMBL3288504 | US9914707, I-7)
Show SMILES Cc1cccc(NC(=O)c2cccc3cc(ccc23)-c2cccc3[nH]nc(N)c23)c1
Show InChI InChI=1S/C25H20N4O/c1-15-5-2-7-18(13-15)27-25(30)21-9-3-6-16-14-17(11-12-19(16)21)20-8-4-10-22-23(20)24(26)29-28-22/h2-14H,1H3,(H,27,30)(H3,26,28,29)
NCI pathway
Reactome pathway
US Patent
n/an/a 7.30n/an/an/an/an/an/a
Schering-Plough Research Institute
Assay Description
The enzyme reaction substrate Poly(Glu, Tyr)4:1 was diluted with potassium-free PBS (10 mM sodium phosphate buffer, 150 mM NaCl, pH 7.2-7.4) to 20 &#...
J Med Chem 51: 725-36 (2008)
BindingDB Entry DOI: 10.7270/Q2DR2XS5
Vascular endothelial growth factor receptor 2
(Homo sapiens (Human))
BDBM50020194
(CHEMBL3288504 | US9914707, I-7)
Show SMILES Cc1cccc(NC(=O)c2cccc3cc(ccc23)-c2cccc3[nH]nc(N)c23)c1
Show InChI InChI=1S/C25H20N4O/c1-15-5-2-7-18(13-15)27-25(30)21-9-3-6-16-14-17(11-12-19(16)21)20-8-4-10-22-23(20)24(26)29-28-22/h2-14H,1H3,(H,27,30)(H3,26,28,29)
NCI pathway
Reactome pathway
n/an/a 7.30n/an/an/an/an/an/a
Chinese Academy of Sciences
Curated by ChEMBL
Assay Description
Inhibition of VEGFR-2 (unknown origin) expressed in baculovirus expression system using poly (4 Glu, Tyr) as substrate after 60 mins by ELISA
ACS Med Chem Lett 5: 592-7 (2014)
Article DOI: 10.1021/ml5000417
BindingDB Entry DOI: 10.7270/Q2TB18GG