BDBM50020389 CHEMBL3289790
SMILES: OC(=O)c1cc(O)c2C(=O)c3c(O)c(O)c(O)cc3C(=O)c2c1
InChI Key: InChIKey=ISMBJFBFEIOUNS-UHFFFAOYSA-N
Data: 1 IC50
Activity Spreadsheet -- Enzyme Inhibition Constant Data from BindingDB
Found 1 hit for monomerid = 50020389
Trg + Lig
Ki
nM
ΔG°
kcal/mole
IC50
nM
Kd
nM
EC50/IC50
nM
koff
s-1
kon
M-1s-1
pHTemp
°C
Accessory gene regulator protein A
(Staphylococcus aureus)
BDBM50020389
(CHEMBL3289790)
Show SMILES OC(=O)c1cc(O)c2C(=O)c3c(O)c(O)c(O)cc3C(=O)c2c1
Show InChI InChI=1S/C15H8O8/c16-7-2-4(15(22)23)1-5-9(7)13(20)10-6(11(5)18)3-8(17)12(19)14(10)21/h1-3,16-17,19,21H,(H,22,23)
n/an/a 1.20E+5n/an/an/an/an/an/a
University of North Carolina at Greensboro
Curated by ChEMBL
Assay Description
Inhibition of AGR quorum sensing system in methicillin-resistant Staphylococcus aureus AH2759 incubated for 15 hrs by P3-LUX reporter gene assay
J Nat Prod 77: 1351-8 (2014)
Article DOI: 10.1021/np5000704
BindingDB Entry DOI: 10.7270/Q21V5GJD