BDBM50020605 CHEMBL3290454
SMILES: NC(=O)c1cc(N)cc2CCOc12
InChI Key: InChIKey=LFJLJGFDJZJTKK-UHFFFAOYSA-N
Data: 1 IC50
Activity Spreadsheet -- Enzyme Inhibition Constant Data from BindingDB
Found 1 hit for monomerid = 50020605
Trg + Lig
Ki
nM
ΔG°
kcal/mole
IC50
nM
Kd
nM
EC50/IC50
nM
koff
s-1
kon
M-1s-1
pHTemp
°C
Poly [ADP-ribose] polymerase 1
(Homo sapiens (Human))
BDBM50020605
(CHEMBL3290454)
Show SMILES NC(=O)c1cc(N)cc2CCOc12
Show InChI InChI=1S/C9H10N2O2/c10-6-3-5-1-2-13-8(5)7(4-6)9(11)12/h3-4H,1-2,10H2,(H2,11,12)
n/an/a>2.50E+4n/an/an/an/an/an/a
St. John's University
Curated by ChEMBL
Assay Description
Inhibition of PARP-1 (unknown origin) using biotinylated NAD+ as substrate after 60 mins by spectrophotometry
J Med Chem 57: 5579-601 (2014)
Article DOI: 10.1021/jm5002502
BindingDB Entry DOI: 10.7270/Q28C9XSS