null
SMILES: NC(=O)c1cc(cc2CCOc12)[N+]([O-])=O
InChI Key: InChIKey=GAMSIIYRKBPBNJ-UHFFFAOYSA-N
Activity Spreadsheet -- Enzyme Inhibition Constant Data from BindingDB
Found 1 hit for monomerid = 50020606
Trg + Lig
Ki
nM
ΔG°
kcal/mole
IC50
nM
Kd
nM
EC50/IC50
nM
koff
s-1
kon
M-1s-1
pHTemp
°C
Poly [ADP-ribose] polymerase 1
(Homo sapiens (Human))
BDBM50020606
(CHEMBL3290453)
Show SMILES NC(=O)c1cc(cc2CCOc12)[N+]([O-])=O
Show InChI InChI=1S/C9H8N2O4/c10-9(12)7-4-6(11(13)14)3-5-1-2-15-8(5)7/h3-4H,1-2H2,(H2,10,12)
n/an/a>2.50E+4n/an/an/an/an/an/a
St. John's University
Curated by ChEMBL
Assay Description
Inhibition of PARP-1 (unknown origin) using biotinylated NAD+ as substrate after 60 mins by spectrophotometry
J Med Chem 57: 5579-601 (2014)
Article DOI: 10.1021/jm5002502
BindingDB Entry DOI: 10.7270/Q28C9XSS