BDBM50020663 CHEMBL3290502
SMILES: [H][C@@]12CC(C)=CC[C@@]1([H])[C@]1([H])[C@H](O)[C@H](O[C@]([H])([C@H](C)CC)C(=C)[C@]1([H])C(C)=C2)\C=C\C=C\C(O)=O
InChI Key: InChIKey=LBYDPIJWXFEKAF-HVTBUZGZSA-N
Data: 1 IC50
Activity Spreadsheet -- Enzyme Inhibition Constant Data from BindingDB
Found 1 hit for monomerid = 50020663
Trg + Lig
Ki
nM
ΔG°
kcal/mole
IC50
nM
Kd
nM
EC50/IC50
nM
koff
s-1
kon
M-1s-1
pHTemp
°C
DNA polymerase beta
(Rattus norvegicus)
BDBM50020663
(CHEMBL3290502)
Show SMILES [H][C@@]12CC(C)=CC[C@@]1([H])[C@]1([H])[C@H](O)[C@H](O[C@]([H])([C@H](C)CC)C(=C)[C@]1([H])C(C)=C2)\C=C\C=C\C(O)=O |r,c:4,28|
Show InChI InChI=1S/C26H36O4/c1-6-16(3)26-18(5)23-17(4)14-19-13-15(2)11-12-20(19)24(23)25(29)21(30-26)9-7-8-10-22(27)28/h7-11,14,16,19-21,23-26,29H,5-6,12-13H2,1-4H3,(H,27,28)/b9-7+,10-8+/t16-,19+,20-,21-,23+,24+,25-,26-/m1/s1
Reactome pathway
n/an/a 1.95E+4n/an/an/an/an/an/a
Kobe Pharmaceutical University
Curated by ChEMBL
Assay Description
Inhibition of rat recombinant DNA polymerase beta expressed in Escherichia coli JMpbeta5 cells assessed as incorporation of [3H]dTTP into poly(dA)/ol...
J Nat Prod 77: 1404-12 (2014)
Article DOI: 10.1021/np500143k
BindingDB Entry DOI: 10.7270/Q24M9639