BDBM50020753 CHEMBL3286973
SMILES: Cl.NC(=N)N1CC2C(C1)C1CCC2C2CC12
InChI Key: InChIKey=PRWCVZWRSUPFNR-UHFFFAOYSA-N
Data: 1 IC50
Activity Spreadsheet -- Enzyme Inhibition Constant Data from BindingDB
Found 1 hit for monomerid = 50020753
Trg + Lig
Ki
nM
ΔG°
kcal/mole
IC50
nM
Kd
nM
EC50/IC50
nM
koff
s-1
kon
M-1s-1
pHTemp
°C
Matrix protein 2
(Influenza A virus (A/Udorn/307/1972(H3N2)))
BDBM50020753
(CHEMBL3286973)
Show SMILES Cl.NC(=N)N1CC2C(C1)C1CCC2C2CC12 |TLB:5:6:10.11:13.15,THB:8:7:10.11:13.15,14:15:10.11:7.6|
Show InChI InChI=1S/C12H19N3.ClH/c13-12(14)15-4-10-6-1-2-7(11(10)5-15)9-3-8(6)9;/h6-11H,1-5H2,(H3,13,14);1H
n/an/a 1.64E+3n/an/an/an/an/an/a
Universitat de Barcelona
Curated by ChEMBL
Assay Description
Inhibition of wild type Influenza A virus (A/udorn/72(H3N2)) M2 channel expressed in Xenopus oocyte plasma membrane incubated for 2 mins measured ove...
J Med Chem 57: 5738-47 (2014)
Article DOI: 10.1021/jm5005804
BindingDB Entry DOI: 10.7270/Q23N24Z2