BDBM50020791 CHEMBL346561::[(3-Acetylsulfanyl-2-methyl-propionyl)-bicyclo[2.2.1]hept-2-yl-amino]-acetic acid
SMILES: CC(CSC(C)=O)C(=O)N(CC(O)=O)C1CC2CCC1C2
InChI Key: InChIKey=ANWXKCAWLVVCJP-UHFFFAOYSA-N
Data: 2 IC50
Activity Spreadsheet -- Enzyme Inhibition Constant Data from BindingDB
Found 2 hits for monomerid = 50020791
Trg + Lig
Ki
nM
ΔG°
kcal/mole
IC50
nM
Kd
nM
EC50/IC50
nM
koff
s-1
kon
M-1s-1
pHTemp
°C
Angiotensin-converting enzyme
(Oryctolagus cuniculus)
BDBM50020791
(CHEMBL346561 | [(3-Acetylsulfanyl-2-methyl-propion...)
Show SMILES CC(CSC(C)=O)C(=O)N(CC(O)=O)C1CC2CCC1C2 |TLB:9:14:20:18.17|
Show InChI InChI=1S/C15H23NO4S/c1-9(8-21-10(2)17)15(20)16(7-14(18)19)13-6-11-3-4-12(13)5-11/h9,11-13H,3-8H2,1-2H3,(H,18,19)
n/an/a 20n/an/an/an/a8.3n/a
TBA
Curated by ChEMBL
Assay Description
In vitro inhibitory activity against rabbit lung Angiotensin I converting enzyme at pH 8.3
J Med Chem 28: 57-66 (1985)
BindingDB Entry DOI: 10.7270/Q2M90975
Angiotensin-converting enzyme
(Oryctolagus cuniculus)
BDBM50020791
(CHEMBL346561 | [(3-Acetylsulfanyl-2-methyl-propion...)
Show SMILES CC(CSC(C)=O)C(=O)N(CC(O)=O)C1CC2CCC1C2 |TLB:9:14:20:18.17|
Show InChI InChI=1S/C15H23NO4S/c1-9(8-21-10(2)17)15(20)16(7-14(18)19)13-6-11-3-4-12(13)5-11/h9,11-13H,3-8H2,1-2H3,(H,18,19)
n/an/a 52n/an/an/an/an/an/a
TBA
Curated by ChEMBL
Assay Description
In vitro inhibitory activity against rabbit lung Angiotensin I converting enzyme at pH 8.3
J Med Chem 28: 57-66 (1985)
BindingDB Entry DOI: 10.7270/Q2M90975