BDBM50020794 CHEMBL348040::[Cyclobutyl-(3-mercapto-2-methyl-propionyl)-amino]-acetic acid
SMILES: CC(CS)C(=O)N(CC(O)=O)C1CCC1
InChI Key: InChIKey=HAHASCMUEWBAFT-UHFFFAOYSA-N
Data: 1 IC50
Activity Spreadsheet -- Enzyme Inhibition Constant Data from BindingDB
Found 1 hit for monomerid = 50020794
Trg + Lig
Ki
nM
ΔG°
kcal/mole
IC50
nM
Kd
nM
EC50/IC50
nM
koff
s-1
kon
M-1s-1
pHTemp
°C
Angiotensin-converting enzyme
(Oryctolagus cuniculus)
BDBM50020794
(CHEMBL348040 | [Cyclobutyl-(3-mercapto-2-methyl-pr...)
Show SMILES CC(CS)C(=O)N(CC(O)=O)C1CCC1
Show InChI InChI=1S/C10H17NO3S/c1-7(6-15)10(14)11(5-9(12)13)8-3-2-4-8/h7-8,15H,2-6H2,1H3,(H,12,13)
n/an/a 18n/an/an/an/an/an/a
TBA
Curated by ChEMBL
Assay Description
In vitro inhibitory activity against rabbit lung Angiotensin I converting enzyme at pH 8.3
J Med Chem 28: 57-66 (1985)
BindingDB Entry DOI: 10.7270/Q2M90975