BDBM50020834 CHEMBL325305::[Cyclopentyl-(3-isopropyl-2-mercapto-benzoyl)-amino]-acetic acid
SMILES: CC(C)c1cccc(C(=O)N(CC(O)=O)C2CCCC2)c1S
InChI Key: InChIKey=HSOHOSHTLFGGTH-UHFFFAOYSA-N
Data: 1 IC50
Activity Spreadsheet -- Enzyme Inhibition Constant Data from BindingDB
Found 1 hit for monomerid = 50020834
Trg + Lig
Ki
nM
ΔG°
kcal/mole
IC50
nM
Kd
nM
EC50/IC50
nM
koff
s-1
kon
M-1s-1
pHTemp
°C
Angiotensin-converting enzyme
(Oryctolagus cuniculus)
BDBM50020834
(CHEMBL325305 | [Cyclopentyl-(3-isopropyl-2-mercapt...)
Show SMILES CC(C)c1cccc(C(=O)N(CC(O)=O)C2CCCC2)c1S
Show InChI InChI=1S/C17H23NO3S/c1-11(2)13-8-5-9-14(16(13)22)17(21)18(10-15(19)20)12-6-3-4-7-12/h5,8-9,11-12,22H,3-4,6-7,10H2,1-2H3,(H,19,20)
n/an/a 1.20E+5n/an/an/an/an/an/a
TBA
Curated by ChEMBL
Assay Description
In vitro inhibitory activity against Angiotensin I converting enzyme
J Med Chem 28: 328-32 (1985)
BindingDB Entry DOI: 10.7270/Q2DN45MJ