BDBM50021264 CHEMBL3287909
SMILES: Cc1nc2c(ccc3ccccc23)c(-c2ccc3OCCCc3c2)c1[C@H](OC(C)(C)C)C(O)=O
InChI Key: InChIKey=ILBUHYAVBSVXKM-MHZLTWQESA-N
Data: 1 Kd
Activity Spreadsheet -- Enzyme Inhibition Constant Data from BindingDB
Found 1 hit for monomerid = 50021264
Trg + Lig
Ki
nM
ΔG°
kcal/mole
IC50
nM
Kd
nM
EC50/IC50
nM
koff
s-1
kon
M-1s-1
pHTemp
°C
Human immunodeficiency virus type 1 integrase
(Human immunodeficiency virus 1)
BDBM50021264
(CHEMBL3287909)
Show SMILES Cc1nc2c(ccc3ccccc23)c(-c2ccc3OCCCc3c2)c1[C@H](OC(C)(C)C)C(O)=O |r|
Show InChI InChI=1S/C29H29NO4/c1-17-24(27(28(31)32)34-29(2,3)4)25(20-12-14-23-19(16-20)9-7-15-33-23)22-13-11-18-8-5-6-10-21(18)26(22)30-17/h5-6,8,10-14,16,27H,7,9,15H2,1-4H3,(H,31,32)/t27-/m0/s1
n/an/an/a 180n/an/an/an/an/a
Boehringer Ingelheim (Canada)
Curated by ChEMBL
Assay Description
Apparent binding affinity to His-tagged HIV integrase
ACS Med Chem Lett 5: 711-6 (2014)
Article DOI: 10.1021/ml500110j
BindingDB Entry DOI: 10.7270/Q2PG1T8J