BDBM50021522 2,5-Bis-(3,4-dimethoxy-phenyl)-3,4-dimethyl-tetrahydro-furan::CHEMBL56917
SMILES: COc1ccc(cc1OC)[C@H]1O[C@@H]([C@@H](C)[C@@H]1C)c1ccc(OC)c(OC)c1
InChI Key: InChIKey=JLJAVUZBHSLLJL-WJWAULOUSA-N
Data: 1 IC50
Activity Spreadsheet -- Enzyme Inhibition Constant Data from BindingDB
Found 1 hit for monomerid = 50021522
Trg + Lig
Ki
nM
ΔG°
kcal/mole
IC50
nM
Kd
nM
EC50/IC50
nM
koff
s-1
kon
M-1s-1
pHTemp
°C
Platelet activating factor receptor
(Cavia porcellus)
BDBM50021522
(2,5-Bis-(3,4-dimethoxy-phenyl)-3,4-dimethyl-tetrah...)
Show SMILES COc1ccc(cc1OC)[C@H]1O[C@@H]([C@@H](C)[C@@H]1C)c1ccc(OC)c(OC)c1
Show InChI InChI=1S/C22H28O5/c1-13-14(2)22(16-8-10-18(24-4)20(12-16)26-6)27-21(13)15-7-9-17(23-3)19(11-15)25-5/h7-14,21-22H,1-6H3/t13-,14-,21-,22-/m0/s1
Reactome pathway
n/an/a 4.50E+3n/an/an/an/an/an/a
TBA
Curated by ChEMBL
Assay Description
Inhibition of PAF receptor binding to rabbit platelet plasma membranes
J Med Chem 29: 1917-21 (1986)
BindingDB Entry DOI: 10.7270/Q2X63KZS