BDBM50021573 CHEBI:81771::CHEMBL1489913
SMILES: O=c1ccc(=O)[nH][nH]1
InChI Key: InChIKey=BGRDGMRNKXEXQD-UHFFFAOYSA-N
Data: 1 IC50
Activity Spreadsheet -- Enzyme Inhibition Constant Data from BindingDB
Found 1 hit for monomerid = 50021573
Trg + Lig
Ki
nM
ΔG°
kcal/mole
IC50
nM
Kd
nM
EC50/IC50
nM
koff
s-1
kon
M-1s-1
pHTemp
°C
Vascular adhesion protein 1 (VAP-1)
(Homo sapiens (Human))
BDBM50021573
(CHEBI:81771 | CHEMBL1489913)
Show SMILES O=c1ccc(=O)[nH][nH]1
Show InChI InChI=1S/C4H4N2O2/c7-3-1-2-4(8)6-5-3/h1-2H,(H,5,7)(H,6,8)
n/an/a 20n/an/an/an/an/an/a
Key Laboratory of Structure-Based Drug Design and Discovery (Shenyang Pharmaceutical University)
Curated by ChEMBL
Assay Description
Inhibition of human VAP1
Eur J Med Chem 83: 581-93 (2014)
Article DOI: 10.1016/j.ejmech.2014.06.068
BindingDB Entry DOI: 10.7270/Q2R78GTF