null
SMILES: COc1ccc(C)cc1-c1cccc2nc(Nc3cc(OC)c(OC)c(OC)c3)oc12
InChI Key: InChIKey=ITJWUDWPWZELPJ-UHFFFAOYSA-N
Activity Spreadsheet -- Enzyme Inhibition Constant Data from BindingDB
Found 2 hits for monomerid = 50021678
Trg + Lig
Ki
nM
ΔG°
kcal/mole
IC50
nM
Kd
nM
EC50/IC50
nM
koff
s-1
kon
M-1s-1
pHTemp
°C
Ribosomal protein S6 kinase alpha-3
(Homo sapiens (Human))
BDBM50021678
(CHEMBL3298047)
Show SMILES COc1ccc(C)cc1-c1cccc2nc(Nc3cc(OC)c(OC)c(OC)c3)oc12
Show InChI InChI=1S/C24H24N2O5/c1-14-9-10-19(27-2)17(11-14)16-7-6-8-18-22(16)31-24(26-18)25-15-12-20(28-3)23(30-5)21(13-15)29-4/h6-13H,1-5H3,(H,25,26)
Reactome pathway
n/an/a 1.45E+4n/an/an/an/an/an/a
Novartis Institutes for Biomedical Research
Curated by ChEMBL
Assay Description
Inhibition of RSK2 in mouse BAF cells assessed as YB1 phosphorylation at Ser102 by electrochemiluminescence assay
Bioorg Med Chem Lett 24: 1592-6 (2014)
Article DOI: 10.1016/j.bmcl.2014.01.058
BindingDB Entry DOI: 10.7270/Q2V126DB
Ribosomal protein S6 kinase alpha-3
(Homo sapiens (Human))
BDBM50021678
(CHEMBL3298047)
Show SMILES COc1ccc(C)cc1-c1cccc2nc(Nc3cc(OC)c(OC)c(OC)c3)oc12
Show InChI InChI=1S/C24H24N2O5/c1-14-9-10-19(27-2)17(11-14)16-7-6-8-18-22(16)31-24(26-18)25-15-12-20(28-3)23(30-5)21(13-15)29-4/h6-13H,1-5H3,(H,25,26)
Reactome pathway
n/an/a 1.10E+3n/an/an/an/an/an/a
Novartis Institutes for Biomedical Research
Curated by ChEMBL
Assay Description
Inhibition of recombinant full length RSK2 (unknown origin) using biotin-AGAGRSRHSSYPAGT-OH as substrate after 150 mins
Bioorg Med Chem Lett 24: 1592-6 (2014)
Article DOI: 10.1016/j.bmcl.2014.01.058
BindingDB Entry DOI: 10.7270/Q2V126DB