BDBM50021706 CHEMBL3297959
SMILES: Cl.C1COc2cc3c(Nc4cccc(c4)-c4ccc[nH]4)ncnc3cc2O1
InChI Key: InChIKey=UZQBMBDIFFZJGU-UHFFFAOYSA-N
Data: 4 IC50
Activity Spreadsheet -- Enzyme Inhibition Constant Data from BindingDB
Found 4 hits for monomerid = 50021706
Trg + Lig
Ki
nM
ΔG°
kcal/mole
IC50
nM
Kd
nM
EC50/IC50
nM
koff
s-1
kon
M-1s-1
pHTemp
°C
Epidermal growth factor receptor
(Homo sapiens (Human))
BDBM50021706
(CHEMBL3297959)
Show SMILES Cl.C1COc2cc3c(Nc4cccc(c4)-c4ccc[nH]4)ncnc3cc2O1
Show InChI InChI=1S/C20H16N4O2.ClH/c1-3-13(16-5-2-6-21-16)9-14(4-1)24-20-15-10-18-19(26-8-7-25-18)11-17(15)22-12-23-20;/h1-6,9-12,21H,7-8H2,(H,22,23,24);1H
n/an/a>1.00E+4n/an/an/an/an/an/a
Universit£ degli Studi di Padova
Curated by ChEMBL
Assay Description
Inhibition of EGFR (unknown origin) assessed as incorporation of [32P] gamma-ATP in to myelin basic protein after 30 mins by autoradiographic analysi...
J Med Chem 57: 4598-605 (2014)
Article DOI: 10.1021/jm500034j
BindingDB Entry DOI: 10.7270/Q2KH0PW0
Proto-oncogene tyrosine-protein kinase Src
(Homo sapiens (Human))
BDBM50021706
(CHEMBL3297959)
Show SMILES Cl.C1COc2cc3c(Nc4cccc(c4)-c4ccc[nH]4)ncnc3cc2O1
Show InChI InChI=1S/C20H16N4O2.ClH/c1-3-13(16-5-2-6-21-16)9-14(4-1)24-20-15-10-18-19(26-8-7-25-18)11-17(15)22-12-23-20;/h1-6,9-12,21H,7-8H2,(H,22,23,24);1H
n/an/a>1.00E+4n/an/an/an/an/an/a
Universit£ degli Studi di Padova
Curated by ChEMBL
Assay Description
Inhibition of Src (unknown origin) assessed as incorporation of [32P] gamma-ATP in to myelin basic protein after 30 mins by autoradiographic analysis
J Med Chem 57: 4598-605 (2014)
Article DOI: 10.1021/jm500034j
BindingDB Entry DOI: 10.7270/Q2KH0PW0
Tyrosine-protein kinase ABL1
(Homo sapiens (Human))
BDBM50021706
(CHEMBL3297959)
Show SMILES Cl.C1COc2cc3c(Nc4cccc(c4)-c4ccc[nH]4)ncnc3cc2O1
Show InChI InChI=1S/C20H16N4O2.ClH/c1-3-13(16-5-2-6-21-16)9-14(4-1)24-20-15-10-18-19(26-8-7-25-18)11-17(15)22-12-23-20;/h1-6,9-12,21H,7-8H2,(H,22,23,24);1H
Reactome pathway
n/an/a>1.00E+4n/an/an/an/an/an/a
Universit£ degli Studi di Padova
Curated by ChEMBL
Assay Description
Inhibition of Abl1 (unknown origin) assessed as incorporation of [32P] gamma-ATP in to myelin basic protein after 30 mins by autoradiographic analysi...
J Med Chem 57: 4598-605 (2014)
Article DOI: 10.1021/jm500034j
BindingDB Entry DOI: 10.7270/Q2KH0PW0
Fibroblast growth factor receptor 1
(Homo sapiens (Human))
BDBM50021706
(CHEMBL3297959)
Show SMILES Cl.C1COc2cc3c(Nc4cccc(c4)-c4ccc[nH]4)ncnc3cc2O1
Show InChI InChI=1S/C20H16N4O2.ClH/c1-3-13(16-5-2-6-21-16)9-14(4-1)24-20-15-10-18-19(26-8-7-25-18)11-17(15)22-12-23-20;/h1-6,9-12,21H,7-8H2,(H,22,23,24);1H
NCI pathway
Reactome pathway
n/an/a>1.00E+4n/an/an/an/an/an/a
Universit£ degli Studi di Padova
Curated by ChEMBL
Assay Description
Inhibition of FGFR1 (unknown origin) assessed as incorporation of [32P] gamma-ATP in to myelin basic protein after 30 mins by autoradiographic analys...
J Med Chem 57: 4598-605 (2014)
Article DOI: 10.1021/jm500034j
BindingDB Entry DOI: 10.7270/Q2KH0PW0