BDBM50021960 CHEMBL286323::Sodium; 3-(5-methoxycarbonyl-[1,2,3]triazol-1-ylmethyl)-3-methyl-2,2,6-trioxo-2lambda*6*-thia-bicyclo[3.2.0]heptane-4-carboxylate
SMILES: COC(=O)c1cnnn1C[C@@]1(C)[C@@H](C2C(CC2=O)S1(=O)=O)C([O-])=O
InChI Key: InChIKey=MWZMTCLBFOZXKV-GPCLJDEGSA-M
Data: 1 IC50
Activity Spreadsheet -- Enzyme Inhibition Constant Data from BindingDB
Found 1 hit for monomerid = 50021960
Trg + Lig
Ki
nM
ΔG°
kcal/mole
IC50
nM
Kd
nM
EC50/IC50
nM
koff
s-1
kon
M-1s-1
pHTemp
°C
Beta-lactamase (TEM-1)
(Escherichia coli)
BDBM50021960
(CHEMBL286323 | Sodium; 3-(5-methoxycarbonyl-[1,2,3...)
Show SMILES COC(=O)c1cnnn1C[C@@]1(C)[C@@H](C2C(CC2=O)S1(=O)=O)C([O-])=O
Show InChI InChI=1S/C13H15N3O7S/c1-13(5-16-6(4-14-15-16)12(20)23-2)10(11(18)19)9-7(17)3-8(9)24(13,21)22/h4,8-10H,3,5H2,1-2H3,(H,18,19)/p-1/t8?,9?,10-,13-/m0/s1
n/an/a 300n/an/an/an/an/an/a
TBA
Curated by ChEMBL
Assay Description
Inhibitory activity against Beta-lactamase from Bacillus sp. using penicillin G as substrate
J Med Chem 30: 1469-74 (1987)
BindingDB Entry DOI: 10.7270/Q28G8JQ0